{"text_format":"1","workbook":"xlsx","n_sheets":5,"sheets":["Pesquisa","Sheet1","Sheet2","Sheet3","Links1_10"],"not_rendered":{"charts":0,"images":1,"macros":1,"external_links":0,"defined_names":3,"comments":0,"pivot_tables":1},"unopened":[],"bounds":{"document_bytes":16777216,"sheet_cells":100000,"rows_first":2000,"rows_last":500,"rows_between":2000,"halvings":0,"cell_chars":16384,"cell_head_chars":4096},"cells_cut":0,"cells_raw":0,"read":"whole","date_system":"1900"}

{"sheet":"Pesquisa","index":0,"n_rows":27,"n_cols":4,"rows_kept":27,"cut":false,"hidden":false,"merged":[[0,3,0,14]]}
[null,null,null,"Pesquisa de artigos"]
[null,null,null,"Selecionar tipo de pesquisa"]
[]
[]
[null,null,null,{"$f":"+IF(Sheet2!W7=3,\"Pesquisa \", \"Selecionar \" )&Sheet2!W6","v":"Selecionar Tema"}]
[]
[]
[null,null,null,"Selecionar artigo "]
[]
[]
[]
[]
[]
[]
[]
[]
[]
[]
[]
[]
[]
[]
[]
[]
[]
[]
[null,null,null,"Selecionar artigo"]

{"sheet":"Sheet1","index":1,"n_rows":627,"n_cols":16,"rows_kept":627,"cut":false,"hidden":true,"merged":[]}
["id","TituloArtigo","Nº","Pagina","Autor1","Autor2","Entidade1","Entidade2","CodSeccao","Lingua","AnoPublicação","Palavras-chave","Obs","Pesquisa","ficheiro","Texto_pesquisa"]
[472,"Cultivar 1 - Publicação Completa",1,1,"Gabinete de Planeamento, Políticas e Administração Geral (GPP)","","","","","","2015","","",0,"Cultivar1.pdf",{"$f":"+B2&E2&F2&G2&H2&I2&J2&K2&L2","v":"Cultivar 1 - Publicação CompletaGabinete de Planeamento, Políticas e Administração Geral (GPP)2015"}]
[1,"Editorial",1,7,"Eduardo Diniz","Diretor-geral","GPP","","","PT","2015","políticas públicas, apresentação da Cultivar, incerteza, risco, custos, variação da oferta, integração de mercados, variação de preços","",null,"Cultivar1CapaEditorial.pdf",{"$f":"+B3&E3&F3&G3&H3&I3&J3&K3&L3","v":"EditorialEduardo DinizDiretor-geralGPPPT2015políticas públicas, apresentação da Cultivar, incerteza, risco, custos, variação da oferta, integração de mercados, variação de preços"}]
[2,"Perspetivas dos mercados agrícolas: fatores de crescimento, incertezas e respostas políticas",1,13,"Tassos Haniotis","Diretor","DG AGRI ","Comissão Europeia","I","PT","2015","Evolução dos preços, Mercados agrícolas, Volatilidade","",null,"Cultivar1GT1HaniotisPT.pdf","Perspetivas dos mercados agrícolas: fatores de crescimento, incertezas e respostas políticasTassos HaniotisDiretorDG AGRI Comissão EuropeiaIPT2015Evolução dos preços, Mercados agrícolas, Volatilidade"]
[3,"Agricultural market outlook: drivers, uncertainties and policy responses",1,21,"Tassos Haniotis","Diretor","DG AGRI ","Comissão Europeia","I","EN","2015","price evolution, agricultural market, volatility","",null,"Cultivar1GT1HaniotisEN.pdf","Agricultural market outlook: drivers, uncertainties and policy responsesTassos HaniotisDiretorDG AGRI Comissão EuropeiaIEN2015price evolution, agricultural market, volatility"]
[4,"Um balanço do uso das matérias-primas utilizadas na produção de biocombustíveis em Portugal",1,27,"Fernando Bianchi de Aguiar","Consultor","Galp Energia","","I","PT","2015","Biocombústiveis, Energia, Emissões","",null,"Cultivar1GT2Bianchi.pdf","Um balanço do uso das matérias-primas utilizadas na produção de biocombustíveis em PortugalFernando Bianchi de AguiarConsultorGalp EnergiaIPT2015Biocombústiveis, Energia, Emissões"]
[5,"As dinâmicas de mercado e os seus impactos na produção de milho em Portugal",1,47,"Jorge Neves","Diretor-geral","Agromais","","I","PT","2015","Milho, Comércio mundial, Globalização","",null,"Cultivar1GT3Neves.pdf","As dinâmicas de mercado e os seus impactos na produção de milho em PortugalJorge NevesDiretor-geralAgromaisIPT2015Milho, Comércio mundial, Globalização"]
[6,"Um novo mundo novo",1,53,"Manuel Marcelo Curto","Embaixador","MNE","","I","PT","2015","Geopolítica, Negociação, Governação internacional","",null,"Cultivar1GT4Curto.pdf","Um novo mundo novoManuel Marcelo CurtoEmbaixadorMNEIPT2015Geopolítica, Negociação, Governação internacional"]
[7,"A evolução da economia agrícola portuguesa",1,63,"Gabinete de Planeamento, Políticas e Administração Geral (GPP)","","GPP","","II","PT","2015","Complexo agroalimentar, Valor acrescentado, Economia","",null,"Cultivar1OBS1GPPEconomia.pdf","A evolução da economia agrícola portuguesaGabinete de Planeamento, Políticas e Administração Geral (GPP)GPPIIPT2015Complexo agroalimentar, Valor acrescentado, Economia"]
[8,"Comércio internacional de produtos agroalimentares, da floresta e das pescas",1,75,"Gabinete de Planeamento, Políticas e Administração Geral (GPP)","","GPP","","II","PT","2015","Exportações, Importações, Balança comercial","",null,"Cultivar1OBS2GPPComercio.pdf","Comércio internacional de produtos agroalimentares, da floresta e das pescasGabinete de Planeamento, Políticas e Administração Geral (GPP)GPPIIPT2015Exportações, Importações, Balança comercial"]
[9,"Mercados agrícolas",1,85,"Gabinete de Planeamento, Políticas e Administração Geral (GPP)","","GPP","","II","PT","2015","Evolução, Produção, Exportações","",null,"Cultivar1OBS3GPPMercados.pdf","Mercados agrícolasGabinete de Planeamento, Políticas e Administração Geral (GPP)GPPIIPT2015Evolução, Produção, Exportações"]
[10,"Índices de preços na cadeia de abastecimento alimentar",1,91,"Gabinete de Planeamento, Políticas e Administração Geral (GPP)","","GPP","","II","PT","2015","PARCA, Crescimento, cadeia alimentar, Preços, Abastecimento","",null,"Cultivar1OBS2GPPPrecos.pdf","Índices de preços na cadeia de abastecimento alimentarGabinete de Planeamento, Políticas e Administração Geral (GPP)GPPIIPT2015PARCA, Crescimento, cadeia alimentar, Preços, Abastecimento"]
[11,"OECD-FAO Agriculture outlook 2014-2013",1,101,"Gabinete de Planeamento, Políticas e Administração Geral (GPP)","","OCDE-FAO","","IIIA","EN","2015","Desenvolvimento, Outlook, Tendências","",null,"Cultivar1ASS1GPPOCDEFAO.pdf","OECD-FAO Agriculture outlook 2014-2013Gabinete de Planeamento, Políticas e Administração Geral (GPP)OCDE-FAOIIIAEN2015Desenvolvimento, Outlook, Tendências"]
[12,"The state of food insecurity in the world 2014",1,105,"Gabinete de Planeamento, Políticas e Administração Geral (GPP)","","FAO","","IIIA","EN","2014","Segurança alimentar, Desenvolvimento, Consumo","",null,"Cultivar1ASS2GPPFAO.pdf","The state of food insecurity in the world 2014Gabinete de Planeamento, Políticas e Administração Geral (GPP)FAOIIIAEN2014Segurança alimentar, Desenvolvimento, Consumo"]
[13,"Modelling adaptation to climate change in agriculture",1,107,"Gabinete de Planeamento, Políticas e Administração Geral (GPP)","","OCDE","","IIIA","EN","2014","Alterações climáticas, Adaptação, Desenvolvimento","",null,"Cultivar1ASS3GPPOCDE.pdf","Modelling adaptation to climate change in agricultureGabinete de Planeamento, Políticas e Administração Geral (GPP)OCDEIIIAEN2014Alterações climáticas, Adaptação, Desenvolvimento"]
[14,"Abolition of the milk quota system in Switzerland",1,109,"Gabinete de Planeamento, Políticas e Administração Geral (GPP)","","European Milk Board","","IIIA","EN","2014","Quotas leiteiras, Produção, Mecanismo","",null,"Cultivar1ASS4GPPEMB.pdf","Abolition of the milk quota system in SwitzerlandGabinete de Planeamento, Políticas e Administração Geral (GPP)European Milk BoardIIIAEN2014Quotas leiteiras, Produção, Mecanismo"]
[473,"Cultivar 2 - Publicação Completa",2,1,"Gabinete de Planeamento, Políticas e Administração Geral (GPP)","","","","","","2015","","",0,"Cultivar2.pdf","Cultivar 2 - Publicação CompletaGabinete de Planeamento, Políticas e Administração Geral (GPP)2015"]
[15,"Editorial",2,7,"Eduardo Diniz","Diretor-geral","GPP","","","PT","2015","políticas públicas, uso sustentável, multidisciplinaridade, sustentabilidade","",null,"Cultivar2CapaEditorial.pdf","EditorialEduardo DinizDiretor-geralGPPPT2015políticas públicas, uso sustentável, multidisciplinaridade, sustentabilidade"]
[16,"Uso sustentável da terra na União Europeia",2,13,"Pia Bucella","","DG ENV","Comissão Europeia","I","","2015","solo, terra, sustentabilidade","",null,"Cultivar2GT1Bucella.pdf",{"$f":"+B19&E19&F19&G19&H19&I19&J19&K19&L19","v":"Uso sustentável da terra na União EuropeiaPia BucellaDG ENVComissão EuropeiaI2015solo, terra, sustentabilidade"}]
[17,"Solos agrícolas: um trunfo para a segurança alimentar e o clima",2,21,"Catherine Geslain-Laneelle","","","","I","","2015","solo, solo agrícola, segurança alimentar, clima","",null,"Cultivar2GT2Laneelle.pdf","Solos agrícolas: um trunfo para a segurança alimentar e o climaCatherine Geslain-LaneelleI2015solo, solo agrícola, segurança alimentar, clima"]
[18,"A importância de uma gestão sustentável do solo para o crescimento futuro da agricultura portuguesa",2,27,"Francisco Avillez e Mário de Carvalho","AGRO.GES; ICAAM","","","I","","2015","solo, gestão sustentável, crescimento, futuro da agricultura","",null,"Cultivar2GT3AvillezCarvalho.pdf","A importância de uma gestão sustentável do solo para o crescimento futuro da agricultura portuguesaFrancisco Avillez e Mário de CarvalhoAGRO.GES; ICAAMI2015solo, gestão sustentável, crescimento, futuro da agricultura"]
[19,"Terra e território na Galiza: o movimento que esconde a imobilidade",2,41,"Francisco Ónega López","","Laboratório do Território","Universidade de Santiago de Compostela","I","","2015","terra, território, Galiza, Espanha","",null,"Cultivar2GT4Lopez.pdf","Terra e território na Galiza: o movimento que esconde a imobilidadeFrancisco Ónega LópezLaboratório do TerritórioUniversidade de Santiago de CompostelaI2015terra, território, Galiza, Espanha"]
[20,"O solo e o direito de propriedade da terra",2,53,"José Moreira da Silva e Alexandre Roque","Presidente","Comissão de Direito Administrativo","Union Internationale des Avocats; SRS Advogados","I","","2015","solo, direito de propriedade, terra","",null,"Cultivar2GT5SilvaRoque.pdf","O solo e o direito de propriedade da terraJosé Moreira da Silva e Alexandre RoquePresidenteComissão de Direito AdministrativoUnion Internationale des Avocats; SRS AdvogadosI2015solo, direito de propriedade, terra"]
[21,"Dinâmicas da utilização do solo pela agricultura",2,63,"Gabinete de Planeamento, Políticas e Administração Geral (GPP)","Rui Pereira","","","II","","2015","estrutura fundiária; ocupação cultural, Inquérito à Estrutura das Explorações Agrícolas; Recenseamento Agrícola","",null,"Cultivar2OBS1GPPSolo.pdf","Dinâmicas da utilização do solo pela agriculturaGabinete de Planeamento, Políticas e Administração Geral (GPP)Rui PereiraII2015estrutura fundiária; ocupação cultural, Inquérito à Estrutura das Explorações Agrícolas; Recenseamento Agrícola"]
[22,"Inventário Florestal Nacional – a dinâmica da ocupação florestal do solo desde o séc. XIX a 2050",2,83,"José Sousa Uva","ICNF","","","II","","2015","Inventário florestal; Área florestal; Uso do solo","",null,"Cultivar2OBS2ICNFUva.pdf","Inventário Florestal Nacional – a dinâmica da ocupação florestal do solo desde o séc. XIX a 2050José Sousa UvaICNFII2015Inventário florestal; Área florestal; Uso do solo"]
[23,"O combate à desertificação e a qualidade das terras em Portugal",2,93,"Lúcio do Rosário","ICNF","","","II","","2015","Desertificação; PANCD; Programa Nacional de Combate à Desertificação; Índice de aridez","",null,"Cultivar2OBS3ICNFRosario.pdf","O combate à desertificação e a qualidade das terras em PortugalLúcio do RosárioICNFII2015Desertificação; PANCD; Programa Nacional de Combate à Desertificação; Índice de aridez"]
[24,"Ano Internacional dos Solos",2,105,"Direção-Geral de Agricultura e Desenvolvimento Rural (DGADR)","","","","IIIA","","2015","Desenvolvimento sustentável; Gestão solos; Parceria Global do Solo","",null,"Cultivar2ASS1DGADRAnoSolos.pdf","Ano Internacional dos SolosDireção-Geral de Agricultura e Desenvolvimento Rural (DGADR)IIIA2015Desenvolvimento sustentável; Gestão solos; Parceria Global do Solo"]
[25,"Policy Approaches to Droughts and Floods in Agricultures",2,115,"Gabinete de Planeamento, Políticas e Administração Geral (GPP)","","OCDE","","IIIA","EN","2015","Políticas para agricultura; Secas e cheias; Alterações climáticas; Gestão de risco","",null,"Cultivar2ASS2GPPOCDE.pdf","Policy Approaches to Droughts and Floods in AgriculturesGabinete de Planeamento, Políticas e Administração Geral (GPP)OCDEIIIAEN2015Políticas para agricultura; Secas e cheias; Alterações climáticas; Gestão de risco"]
[26,"Voluntary Guidelines on the Responsible Governance of Tenure and Land, \nFisheries and Forest in the Context of National Food Security",2,120,"Gabinete de Planeamento, Políticas e Administração Geral (GPP)","","FAO","","IIIA","EN","2012","Acesso à terra; Segurança alimentar; Gestão responsável pela posse da terra","",null,"Cultivar2ASS3GPPFAO.pdf","Voluntary Guidelines on the Responsible Governance of Tenure and Land, \nFisheries and Forest in the Context of National Food SecurityGabinete de Planeamento, Políticas e Administração Geral (GPP)FAOIIIAEN2012Acesso à terra; Segurança alimentar; Gestão responsável pela posse da terra"]
[27,"Estratégia Nacional para as Florestas",2,124,"Gabinete de Planeamento, Políticas e Administração Geral (GPP)","","Governo de Portugal","","IIIA","PT","2015","Estratégia Nacional para as Florestas; Gestão Florestal; Ocupação florestal","",null,"Cultivar2ASS4ICNFEstrategiaFlorestas.pdf","Estratégia Nacional para as FlorestasGabinete de Planeamento, Políticas e Administração Geral (GPP)Governo de PortugalIIIAPT2015Estratégia Nacional para as Florestas; Gestão Florestal; Ocupação florestal"]
{"$rows_left_out":598}
{"sheet":"Sheet2","index":2,"n_rows":574,"n_cols":23,"rows_kept":574,"cut":false,"hidden":true,"merged":[]}
[]
[]
[null,{"$f":"+COUNT(Sheet1!A2:A333)","v":332}]
[null,null,null,null,null,null,null,null,null,null,{"$f":"+INDEX(Sheet1!$C$2:$C$1002,MATCH(Sheet2!$I$6,Sheet1!$A$2:$A$1002,0))","v":{"$error":"#VALUE!"}},{"$f":"+INDEX(Sheet1!$D$2:$D$1002,MATCH(Sheet2!$I$6,Sheet1!$A$2:$A$1002,0))","v":{"$error":"#VALUE!"}},{"$f":"+INDEX(Links1_10!B2:B50,MATCH(Sheet2!K4,Links1_10!A2:A50,0))","v":{"$error":"#VALUE!"}}]
[]
[{"$f":"+INDEX(A8:A241,G7)","v":{"$error":"#VALUE!"}},null,null,null,null,null,{"$f":"+INDEX(G8:G1000,G7)","v":{"$error":"#VALUE!"}},null,{"$f":"+INDEX(J8:J149,J6)","v":{"$error":"#VALUE!"}},0,null,null,null,null,null,null,null,null,null,null,null,null,{"$f":"+INDEX(W9:W11,W7)","v":"Tema"}]
["Nº","Tema","Data",null,null,null,0,null,null,"id","TituloArtigo","Nº","Pagina","Autor1","Autor2","Entidade1","Entidade2","CodSeccao","Lingua","AnoPublicação","Palavras-chave",2,1]
[1,"Volatilidade dos mercados","2015-06-01",{"$f":"+A8& \" - \" &B8","v":"1 - Volatilidade dos mercados"},null,null,{"$f":"+IF($W$7=1,D8,IF($W$7=2,H8,$G$7))","v":"1 - Volatilidade dos mercados"},"Abílio Dias Fernandes",{"$f":"IF(J8>0, \"Tema \" & L8 & \"  -  \" & K8,\"\" )","v":""},null,null,null,null,null,null,null,null,null,null,null,null,"ID1","tipo pesquisa"]
[2,"Solo","2015-11-01",{"$f":"+A9& \" - \" &B9","v":"2 - Solo"},null,null,{"$f":"+IF($W$7=1,D9,IF($W$7=2,H9,$G$7))","v":"2 - Solo"},"Adam Smith",{"$f":"IF(J9>0, \"Tema \" & L9 & \"  -  \" & K9,\"\" )","v":""},null,null,null,null,null,null,null,null,null,null,null,null,1,"Tema"]
[3,"Alimentação sustentável e saudável","2016-03-01","3 - Alimentação sustentável e saudável",null,null,"3 - Alimentação sustentável e saudável","Aida Campos e Narcisa Bandarra","",null,null,null,null,null,null,null,null,null,null,null,null,2,"Autor"]
[4,"Tecnologia","2016-06-01","4 - Tecnologia",null,null,"4 - Tecnologia","Alan Matthews","",null,null,null,null,null,null,null,null,null,null,null,null,3,"Livre"]
[5,"Economia da água","2016-09-01","5 - Economia da água",null,null,"5 - Economia da água","Albert Silbert, Orlando Ribeiro, 1970",""]
[6,"Comércio internacional","2016-11-01","6 - Comércio internacional",null,null,"6 - Comércio internacional","Alberto Ribeiro de Almeida",""]
[7,"O risco na atividade económica","2017-03-01","7 - O risco na atividade económica",null,null,"7 - O risco na atividade económica","Alessando Gargani, Gianluca Massimi, Vincent Floreani e Balazs Podmaniczky",""]
[8,"Biodiversidade","2017-06-01","8 - Biodiversidade",null,null,"8 - Biodiversidade","Alexandra Prado Coelho",""]
[9,"Gastronomia","2017-09-01","9 - Gastronomia",null,null,"9 - Gastronomia","Alfredo Cunhal Sendim",""]
[10,"Trabalho na agricultura e novas tendências laborais","2017-12-01","10 - Trabalho na agricultura e novas tendências laborais",null,null,"10 - Trabalho na agricultura e novas tendências laborais","Alfredo Serra Mendes",""]
[11,"População e território rural","2018-03-01","11 - População e território rural",null,null,"11 - População e território rural","Álvaro Garrido",""]
[12,"Alterações climáticas","2018-06-01","12 - Alterações climáticas",null,null,"12 - Alterações climáticas","Ana Costa Freitas",""]
[13,"A cadeia de valor do setor agroalimentar","2018-09-01","13 - A cadeia de valor do setor agroalimentar",null,null,"13 - A cadeia de valor do setor agroalimentar","Ana Filipa Fernandes e Guilherme Azambuja",""]
[14,"O eucalipto","2018-12-01","14 - O eucalipto",null,null,"14 - O eucalipto","Ana Filipe de Morais",""]
[15,"Bioeconomia","2019-03-01","15 - Bioeconomia",null,null,"15 - Bioeconomia","Ana Maria Barata, Carlos Gaspar, Filomena Rocha, Isabel Silva, Madalena Vaz, Octávio Serra e Violeta Lopes",""]
[16,"Digitalização","2019-06-01","16 - Digitalização",null,null,"16 - Digitalização","Ana Maria Barata, Carlos Gaspar, Filomena Rocha, Violeta Lopes",""]
[17,"Ensino  agrícola","2019-09-19","17 - Ensino  agrícola",null,null,"17 - Ensino  agrícola","Ana Rita Moura",""]
[18,"Energia na agricultura","2019-12-01","18 - Energia na agricultura",null,null,"18 - Energia na agricultura","Ana Rita Moura e Ana Teresa Silva",""]
[19,"Macroeconomia e agricultura","2020-04-20","19 - Macroeconomia e agricultura",null,null,"19 - Macroeconomia e agricultura","Ana Rita Moura e Rui Trindade",""]
[20,"Abastecimento alimentar: que fronteiras?","2020-08-20","20 - Abastecimento alimentar: que fronteiras?",null,null,"20 - Abastecimento alimentar: que fronteiras?","Ana Sofia Sampaio",""]
[21,"Sistemas agroflorestais","2020-12-31",{"$f":"+A28& \" - \" &B28","v":"21 - Sistemas agroflorestais"},null,null,"21 - Sistemas agroflorestais","Anove – Asociación Nacional de Obtentores Vegetales; Institut Cerdà",""]
["22a","Edição especial (PT)","2021-04-01",{"$f":"+A29& \" - \" &B29","v":"22a - Edição especial (PT)"},null,null,"22a - Edição especial (PT)","ANSEME e Plataforma Transgénicos Fora",""]
["22b","Special issue (EN)","2021-04-01",{"$f":"+A30& \" - \" &B30","v":"22b - Special issue (EN)"},null,null,"22b - Special issue (EN)","Antero Martins e Elsa Gonçalves",""]
{"$rows_left_out":545}
{"sheet":"Sheet3","index":3,"n_rows":292,"n_cols":1,"rows_kept":292,"cut":false,"hidden":true,"merged":[]}
[]
[]
["Rótulos de Linha"]
["Abílio Dias Fernandes"]
["Adam Smith"]
["Aida Campos e Narcisa Bandarra"]
["Alan Matthews"]
["Albert Silbert, Orlando Ribeiro, 1970"]
["Alberto Ribeiro de Almeida"]
["Alessando Gargani, Gianluca Massimi, Vincent Floreani e Balazs Podmaniczky"]
["Alexandra Prado Coelho"]
["Alfredo Cunhal Sendim"]
["Alfredo Serra Mendes"]
["Álvaro Garrido"]
["Ana Costa Freitas"]
["Ana Filipa Fernandes e Guilherme Azambuja"]
["Ana Filipe de Morais"]
["Ana Maria Barata, Carlos Gaspar, Filomena Rocha, Isabel Silva, Madalena Vaz, Octávio Serra e Violeta Lopes"]
["Ana Maria Barata, Carlos Gaspar, Filomena Rocha, Violeta Lopes"]
["Ana Rita Moura"]
["Ana Rita Moura e Ana Teresa Silva"]
["Ana Rita Moura e Rui Trindade"]
["Ana Sofia Sampaio"]
["Anove – Asociación Nacional de Obtentores Vegetales; Institut Cerdà"]
["ANSEME e Plataforma Transgénicos Fora"]
["Antero Martins e Elsa Gonçalves"]
["António Alberto Gonçalves Ferreira e António Gonçalves Ferreira"]
["António Cerca Miguel"]
["António Cunha"]
["Antonio Duarte Pinho"]
{"$rows_left_out":263}
{"sheet":"Links1_10","index":4,"n_rows":33,"n_cols":3,"rows_kept":33,"cut":false,"hidden":true,"merged":[]}
["N.º","Link novo","Link antigo"]
[1,"https://www.gpp.pt/images/GPP/O_que_disponibilizamos/Publicacoes/CULTIVAR_1/E_book/CULTIVAR_1_Volatilidade_dos_Mercados_Agricolas/","https://www.gpp.pt/images/GPP/O_que_disponibilizamos/Publicacoes/CULTIVAR_1/CULTIVAR_1/assets/basic-html/"]
[2,"https://www.gpp.pt/images/GPP/O_que_disponibilizamos/Publicacoes/CULTIVAR_2/E_book/CULTIVAR_2_O_SOLO/","https://www.gpp.pt/images/GPP/O_que_disponibilizamos/Publicacoes/CULTIVAR_2/CULTIVAR_2/assets/basic-html/"]
[3,"https://www.gpp.pt/images/GPP/O_que_disponibilizamos/Publicacoes/CULTIVAR_3/E_book/CULTIVAR_3_Alimentacao_sustentavel_e_saudavel/"]
[4,"https://www.gpp.pt/images/GPP/O_que_disponibilizamos/Publicacoes/CULTIVAR_4/E_book/CULTIVAR_4_Tecnologia/"]
[5,"https://www.gpp.pt/images/GPP/O_que_disponibilizamos/Publicacoes/CULTIVAR_5/E_book/CULTIVAR_5_Economia_da_agua/"]
[6,"https://www.gpp.pt/images/GPP/O_que_disponibilizamos/Publicacoes/CULTIVAR_6/E_book/CULTIVAR_6_Comercio_Internacional/"]
[7,"https://www.gpp.pt/images/GPP/O_que_disponibilizamos/Publicacoes/CULTIVAR_7/E-book/CULTIVAR_7_O_Risco_na_atividade_economica/"]
[8,"https://www.gpp.pt/images/GPP/O_que_disponibilizamos/Publicacoes/CULTIVAR_8/E-book/CULTIVAR_8_Biodiversidade/"]
[9,"https://www.gpp.pt/images/GPP/O_que_disponibilizamos/Publicacoes/CULTIVAR_9/E_book/CULTIVAR_9_Gastronomia/"]
[10,"https://www.gpp.pt/images/GPP/O_que_disponibilizamos/Publicacoes/CULTIVAR_10/E_book/CULTIVAR_10_Trabalho_na_agricultura_e_as_novas_tendencias_laborais/"]
[11,{"$f":"+ \"https://www.gpp.pt/images/GPP/O_que_disponibilizamos/Publicacoes/CULTIVAR_\" &A12","v":"https://www.gpp.pt/images/GPP/O_que_disponibilizamos/Publicacoes/CULTIVAR_11"}]
[12,{"$f":"+ \"https://www.gpp.pt/images/GPP/O_que_disponibilizamos/Publicacoes/CULTIVAR_\" &A13","v":"https://www.gpp.pt/images/GPP/O_que_disponibilizamos/Publicacoes/CULTIVAR_12"}]
[13,{"$f":"+ \"https://www.gpp.pt/images/GPP/O_que_disponibilizamos/Publicacoes/CULTIVAR\" &A14","v":"https://www.gpp.pt/images/GPP/O_que_disponibilizamos/Publicacoes/CULTIVAR13"}]
[14,{"$f":"+ \"https://www.gpp.pt/images/GPP/O_que_disponibilizamos/Publicacoes/CULTIVAR\" &A15","v":"https://www.gpp.pt/images/GPP/O_que_disponibilizamos/Publicacoes/CULTIVAR14"}]
[15,{"$f":"+ \"https://www.gpp.pt/images/GPP/O_que_disponibilizamos/Publicacoes/CULTIVAR_\" &A16","v":"https://www.gpp.pt/images/GPP/O_que_disponibilizamos/Publicacoes/CULTIVAR_15"}]
[16,"https://www.gpp.pt/images/GPP/O_que_disponibilizamos/Publicacoes/CULTIVAR_16"]
[17,"https://www.gpp.pt/images/GPP/O_que_disponibilizamos/Publicacoes/CULTIVAR_17"]
[18,"https://www.gpp.pt/images/GPP/O_que_disponibilizamos/Publicacoes/CULTIVAR_18"]
[19,"https://www.gpp.pt/images/GPP/O_que_disponibilizamos/Publicacoes/CULTIVAR_19"]
[20,"https://www.gpp.pt/images/GPP/O_que_disponibilizamos/Publicacoes/CULTIVAR_20"]
[21,"https://www.gpp.pt/images/GPP/O_que_disponibilizamos/Publicacoes/CULTIVAR_21"]
["22a","https://www.gpp.pt/images/GPP/O_que_disponibilizamos/Publicacoes/CULTIVAR_22/E-book_PT/CULTIVAR_22-Edicao_especial"]
["22b","https://www.gpp.pt/images/GPP/O_que_disponibilizamos/Publicacoes/CULTIVAR_22/E-book_EN/CULTIVAR_22-Special_Issue","https://www.gpp.pt/images/GPP/O_que_disponibilizamos/Publicacoes/CULTIVAR_22/E-book_PT/CULTIVAR_22-Edicao_especial/"]
[23,"https://www.gpp.pt/images/GPP/O_que_disponibilizamos/Publicacoes/CULTIVAR_23/"]
[24,"https://www.gpp.pt/images/GPP/O_que_disponibilizamos/Publicacoes/CULTIVAR_24/"]
[25,"https://www.gpp.pt/images/GPP/O_que_disponibilizamos/Publicacoes/CULTIVAR_25/"]
[26,"https://www.gpp.pt/images/GPP/O_que_disponibilizamos/Publicacoes/CULTIVAR_26/"]
[27,"https://www.gpp.pt/images/GPP/O_que_disponibilizamos/Publicacoes/CULTIVAR_27/"]
[28,"https://www.gpp.pt/images/GPP/O_que_disponibilizamos/Publicacoes/CULTIVAR_28/"]
{"$rows_left_out":3}