{"text_format":"1","workbook":"xlsx","n_sheets":12,"sheets":["Portugal","Indice","Continente","1989","1999","2009","2013","Evolução Estrutura","2016","2019","Sheet1","Evolução regional"],"not_rendered":{"charts":3,"images":4,"macros":1,"external_links":0,"defined_names":2,"comments":1,"pivot_tables":0},"unopened":[],"bounds":{"document_bytes":16777216,"sheet_cells":100000,"rows_first":2000,"rows_last":500,"rows_between":2000,"halvings":0,"cell_chars":16384,"cell_head_chars":4096},"cells_cut":0,"cells_raw":0,"read":"whole","date_system":"1900"}

{"sheet":"Portugal","index":0,"n_rows":173,"n_cols":16,"rows_kept":173,"cut":false,"hidden":true,"merged":[[0,0,0,3],[1,0,1,3]]}
["Portugal",null,null,null,1989,1993,1995,1997,1999,2003,2005,2007,2009,2013,2016,2019]
["EXPLORAÇÕES (nº)"]
["Portugal",null,null,null,598742,489011,450635,416689,415969,359248,323920,275085,305266,264419,258983,290229]
["    Continente",null,null,null,550879,446145,412065,381794,382163,330619,297046,251548,278114,240527,235774,266039]
["      Entre Douro e Minho",null,null,null,111505,86967,79916,73048,67546,58757,52696,45848,49037,41601,39651,44560]
["  Trás-os-Montes",null,null,null,80551,75678,72248,70098,70006,64963,61649,56339,61804,57224,56228,65211]
["      Beira Litoral",null,null,null,125307,97459,88547,80217,79806,66060,58823,47542,49424,38356,39462,44245]
["  Beira Interior",null,null,null,60386,49533,45878,42841,48313,40788,35749,30357,33763,30862,29065,33617]
["      Ribatejo e Oeste",null,null,null,99938,78609,71430,64874,61615,52339,43850,33225,39875,31450,31217,34486]
["  Alentejo",null,null,null,47049,37491,36114,34722,35906,31830,29558,26032,31828,29478,28424,31131]
["      Algarve",null,null,null,26143,20409,17931,15993,18971,15883,14721,12204,12383,11556,11728,12789]
["Açores",null,null,null,24706,21998,20141,18056,19280,16191,15285,13155,13541,11825,11580,10656]
["    Madeira",null,null,null,23157,20868,18430,16839,14526,12437,11589,10382,13611,12068,11628,13534]
[]
["Explorações por Classe de SAU (nº)"]
["> 0 a <5 ha",null,null,null,488075,380765,344412,316069,324432,273172,241019,198688,229526,190305,183881,208961]
["5 a 50 ha",null,null,null,97107,97441,95228,90037,78275,74166,71280,65678,63881,62568,62941,64614]
["> 50 ha",null,null,null,9236,9470,9799,9592,9905,9729,10318,9828,10460,10702,10915,12616]
[]
["SUPERFÍCIE TOTAL DAS EXPLORAÇÕES (ha)"]
["Portugal",null,null,null,5316160,5158217,5084776,4949393,5188938,4888500,4779428,4408426,4709131,4625696,4663173,5121412.68]
["Superfície agrícola utilizada",null,null,null,4005573,3949550,3924621,3822125,3863094,3725190,3679587,3472939,3668145,3641592,3641691,3963944.56]
["Matas e florestas sem culturas sob-coberto",null,null,null,978259,880552,816364,815214,1008374,891520,851027,721828,842208,807638,837067,966077.11]
["Superfície agrícola não utilizada",null,null,null,245110,224720,220425,210017,202898,182369,160689,136409,127691,100959,98452,91781.03]
["Outras superfícies",null,null,null,87219,103395,123366,102037,114573,89421,88125,77250,71087,75507,85962,99609.88]
[]
["SAU (ha)"]
["Portugal",null,null,null,4005573,3949550,3924621,3822125,3863094,3725190,3679587,3472939,3668145,3641592,3641691,3963944.5599999996]
["    Continente",null,null,null,3879579,3821319,3800379,3700161,3736140,3578034,3552347,3357019,3542305,3517740,3513006,3838708.11]
["      Entre Douro e Minho",null,null,null,289624,257684,239465,243450,215675,233702,232260,220371,211154,214554,198415,212639.49]
["  Trás-os-Montes",null,null,null,489133,493229,495965,462230,457881,467158,473530,474617,432873,432056,454719,450701.26]
["      Beira Litoral",null,null,null,231458,220532,205702,179896,169779,154781,151949,135986,125436,117387,122929,129847.61]
["  Beira Interior",null,null,null,433947,443745,441138,435052,418977,390252,384005,352257,337031,341976,356488,391753.98]
["      Ribatejo e Oeste",null,null,null,456544,498887,483831,494427,447853,381558,412093,349237,391006,370390,378010,409094.61]
["  Alentejo",null,null,null,1842094,1766678,1800535,1757360,1924043,1836215,1792285,1721795,1956508,1949142,1906874,2144066.33]
["      Algarve",null,null,null,136779,140565,133743,127745,101932,114368,106225,102756,88297,92234,95570,100604.83]
["Açores",null,null,null,118983,120223,116882,114649,121308,142054,122783,112054,120412,118589,123793,120632.09]
["    Madeira",null,null,null,7012,8007,7360,7315,5645,5102,4458,3865,5428,5262,4893,4604.3599999999997]
[]
["SAU por Classe de SAU"]
["<5 ha",null,null,null,757844,649459,596920,548113,532868,480022,416675,348663,397027,339046,330987,365566.03]
["5 a 50 ha",null,null,null,1168502,1214021,1205545,1145960,1007435,971139,935434,875723,850361,872231,873819,893520.57]
["> 50 ha",null,null,null,2079228,2086070,2122156,2128051,2322791,2274029,2327478,2248552,2420757,2430314,2436885,2704857.96]
[]
["Composição da SAU"]
["Terras aráveis",null,null,null,2345656,2273617,2125450,2096286,1740016,1528307,1240701,1077704,1173127,1100861,1043298,1036681.61]
["Horta familiar",null,null,null,32488,30683,27826,26141,21606,19972,21408,18410,19695,15381,16331,16152.4]
["Culturas permanentes",null,null,null,789415,756882,746972,707865,711628,682597,648863,596246,690725,708765,705120,860662.61]
["Pastagens permanentes",null,null,null,838015,888368,1024373,991832,1389844,1494314,1768616,1780579,1784598,1816585,1876943,2050447.94]
["Das quais Pobres:",null,null,null,350343,300950,323422,373744,879592,1048207,1253239,1274245,1331198,1280628,1391293,1464534.05]
["Cultura temporárias(1) (ha)"]
["Total",null,null,null,1895293,1690480,1621049,1504730,1399335,1197622,1008690,875324,948470,864900,882270,888383.64]
["Cereais para grão",null,null,null,900878,705470,677560,651130,602270,480160,384452,303751,345941,305900,255189,234598.69]
["Leguminosas secas para grão",null,null,null,81976,42572,39060,28999,25724,21915,14033,15577,13239,9318,18084,18695.98]
["Prados temporários",null,null,null,74231,48134,45791,43576,37250,45280,49219,64720,31661,35576,99676,120575.71]
["Culturas forrageiras",null,null,null,578458,652701,635145,601532,542120,501964,478095,401585,462703,433258,423670,433043.64]
["Batata",null,null,null,107187,85240,80747,58613,50173,38911,26223,22356,18745,13031,11749,13382.68]
["Beterraba sacarina",null,null,null,256,483,584,239,7695,5233,7166,2317,139,547,99]
["Culturas industriais",null,null,null,64203,83651,77184,57282,74537,51074,9020,17590,24923,19239,20035,10692]
["Culturas hortícolas",null,null,null,62819,52307,55510,51220,50772,43658,36976,38489,48002,42645,48579,51995.54]
["Flores e plantas ornamentais",null,null,null,670,900,855,1126,1116,1424,1565,1768,1643,2733,1353,1922.42]
["Outras culturas temporárias",null,null,null,24614,19023,8614,11012,7673,8005,1943,7171,1472,2651,3837,3476.98]
[]
["Pousio (ha)",null,null,null,830335,921988,809337,859019,562717,518007,373703,325062,341534,333072,251759,224399.37]
["Superfície cultivada",null,null,null,{"$f":"+E28-E50-E64","v":2824895},{"$f":"+F28-F50-F64","v":2726612},2791862,2589362,2420785,2158976,2052645,1873632,1995413,2027892,1998639,2275011.1399999997]
[]
["CULTURAS PERMANENTES (ha)"]
["Frutos frescos (excepto citrinos)",null,null,null,76266,76780,70990,62914,52746,46753,40507,37014,40127,43060,47040,51674.45]
["Citrinos",null,null,null,26759,26363,24965,24582,23453,21111,19906,18603,16930,17972,18233,19613.23]
["Frutos sub-tropicais",null,null,null,3047,3226,2826,2771,2612,2210,2493,2529,3048,3790,4871,7702.28]
["Frutos de casca rija",null,null,null,73860,70151,71534,74874,80470,73005,71243,69033,115150,139981,142797,228707.24]
["Olival",null,null,null,340514,321675,330337,308731,335028,324061,317046,292162,335841,340284,325755,377234.45]
["Vinha",null,null,null,266326,256090,243877,231413,215041,213149,195595,174559,177831,162208,162673,173254.06]
["Outras culturas permanentes",null,null,null,2643,2597,2444,2580,2277,2306,2074,2345,1799,1470,3751,2476.9]
[]
["PRADOS E PASTAGENS PERMANENTES (2) (ha)",null,null,null,856334,912462,1052793,1018960,1436823,1545470,1815704,1823588,1827899,1872252,1927983,2094289.41]
["(1) Inclui culturas sucessivas e sob coberto de permanentes","(1) Inclui culturas sucessivas e sob coberto de permanentes","(1) Inclui culturas sucessivas e sob coberto de permanentes","(1) Inclui culturas sucessivas e sob coberto de permanentes"]
["(2) inclui pastagens sob coberto de permanentes","(2) inclui pastagens sob coberto de permanentes","(2) inclui pastagens sob coberto de permanentes","(2) inclui pastagens sob coberto de permanentes"]
[]
[null,null,null,null,1989,1993,1995,1997,1999,2003,2005,2007,2009,2013,2016,2019]
["Superfície Irrigável"]
["Portugal",null,null,null,877695,834254,796538,798274,791986,"n.d",616982,583736,540593,551427,547838,630517.12999999989]
["  Continente",null,null,null,871590,826628,789727,791355,787236,"n.d",613209,580164,536127,547119,543745,626820.28999999992]
["Entre Douro e Minho",null,null,null,225517,206876,189320,186069,148305,"n.d",118667,115633,94829,106476,90938,91281]
["Trás-os-Montes",null,null,null,99854,115563,113943,112582,93101,"n.d",67215,53153,46666,46675,43953,42658.36]
["Beira Litoral",null,null,null,143821,137292,121984,108008,104609,"n.d",82996,76595,61116,57133,56385,55614.54]
["Beira Interior",null,null,null,112734,95693,84986,88021,92717,"n.d",69918,61928,49580,38008,45571,55897.01]
["Ribatejo e Oeste",null,null,null,144692,143313,145815,146604,154509,"n.d",109076,116336,112539,111985,114330,126083.9]
["Alentejo",null,null,null,110753,93551,99870,115652,163983,"n.d",140376,136856,155123,169573,175410,232627.36]
["Algarve",null,null,null,34218,34340,33809,34419,30012,"n.d",24962,19663,16274,17269,17158,22658.12]
[" Açores",null,null,null,0,0,0,0,0,"n.d",0,0,0,0,0,0]
[" Madeira",null,null,null,6105,7626,6811,6918,4750,"n.d",3773,3572,4466,4308,4092,3696.84]
[]
[null,null,null,null,1989,1993,1995,1997,1999,2003,2005,2007,2009,2013,2016,2019]
["Efetivos (Cabeças Normais)"]
["Portugal",null,null,null,2432246,2366259,2355441,2337712,2551317,2354641,2069793,2014854,2205950,2035510,2223716,2503692.673]
["  Continente",null,null,null,2244750,2172008,2153381,2137756,2326716,2141186,1870284,1818513,1986998,1821369,2003127,2267449.1399999997]
["Entre Douro e Minho",null,null,null,388240,362528,370666,355515,338093,312049,264036,252849,262882,250374,250272,237875.62400000001]
["Trás-os-Montes",null,null,null,171436,149289,155925,156310,146251,128966,113109,111591,105501,100703,131956,94805.581000000006]
["Beira Litoral",null,null,null,451737,429439,420307,409316,421915,377544,347084,322546,340199,276747,323201,418733.80599999998]
["Beira Interior",null,null,null,153055,141195,144140,146145,139043,131171,112322,106514,107103,103087,108232,132886.875]
["Ribatejo e Oeste",null,null,null,578619,613489,566832,557618,660006,585432,441481,437883,510485,456473,506302,658866.772]
["Alentejo",null,null,null,446631,437198,458583,477532,581052,569037,566410,561773,641608,614835,664301,707170.20900000003]
["Algarve",null,null,null,55033,38870,36926,35320,40358,36983,25841,25357,19222,19149,18863,17110.273000000001]
["  Açores",null,null,null,170555,175784,185651,182623,208608,200649,186288,185120,205684,204774,211877,226222.65100000001]
[" Madeira",null,null,null,16942,18467,16408,17331,15992,12806,13220,11223,13271,9368,8714,10020.882]
[]
[null,null,null,null,1989,1993,1995,1997,1999,2003,2005,2007,2009,2013,2016,2019]
["CN"]
["Por Espécie",null,null,null,{"$f":"SUM(E111:E117)","v":2432246},{"$f":"SUM(F111:F117)","v":2366259},2355441,2337712,2551317,2354641,2069793,2014854,2205950,2035510,2223716,2503692.673]
["Equideos",null,null,null,120712,95144,87072,79787,77177,64590,49564,41981,44811,39131,34228,31575.200000000001]
["Bovinos",null,null,null,1021766,936287,1022773,989503,1029179,1011073,950168,943203,1029905,1007666,1116355,1116399]
["Ovinos",null,null,null,292628,278592,277994,273710,292977,268459,253287,233961,221964,206723,219966,218201.60000000001]
["Caprinos",null,null,null,72052,61635,58585,55129,53724,44203,44373,38915,42071,38303,39046,37234.1]
["Aves",null,null,null,336742,344860,322187,334289,490911,435677,311863,322745,403047,310192,377552,576143.39500000002]
["Suínos",null,null,null,578740,641470,579077,598546,600582,524415,455210,429200,458806,430119,434426,520758.73800000001]
["Coelhos",null,null,null,9606,8271,7753,6748,6767,6224,5328,4849,5346,3376,2143,3380.64]
[]
[null,null,null,null,1989,1993,1995,1997,1999,2003,2005,2007,2009,2013,2016,2019]
["VOLUME DE TRABALHO (UTA)"]
["Portugal",null,null,null,850031,611502,587367,523569,526145,457647,400021,339894,367393,328658,318292,314508.942223989]
["  Continente",null,null,null,810005,576661,551197,492999,497537,431521,376370,319369,341502,304677,295316,293236.36222412001]
["Entre Douro e Minho",null,null,null,218450,153824,150023,127545,122487,103124,88050,74273,78758,68404,58000,56657.898889286]
["Trás-os-Montes",null,null,null,99162,81023,81412,73226,81566,77400,67260,65072,69330,68998,71193,62773.631667018002]
["Beira Litoral",null,null,null,188075,127288,121948,105164,107553,88993,79738,59518,65502,48669,46289,47052.799445026998]
["Beira Interior",null,null,null,85447,52671,47625,46443,49193,44165,42588,33624,33552,30355,26215,27098.371111459001]
["Ribatejo e Oeste",null,null,null,126898,93835,89504,83768,75630,63629,50047,42447,47269,40832,38663,41751.753889141]
["Alentejo",null,null,null,61913,48043,43524,42942,44162,40862,35491,32918,35659,35617,41838,44182.093333361998]
["Algarve",null,null,null,30061,19976,17161,13911,16946,13348,13197,11515,11432,11801,13117,13719.813888827]
["  Açores",null,null,null,20344,16876,16036,14821,15452,13827,12423,11494,11532,11206,12183,10594.110000084]
[" Madeira",null,null,null,19681,17965,20134,15749,13156,12299,11228,9032,14360,12775,10793,10678.469999785]
[]
["Tipo de Mão-de-Obra"]
["Mão-de-obra agrícola familiar",null,null,null,720876,513767,490281,431414,431632,374112,329688,277064,294415,250059,229952,213983.875]
["Produtor",null,null,null,329559,248381,237999,214743,219568,193616,175503,148680,160354,135105,126540,120212.5]
["Mão-de-obra agrícola não familiar",null,null,null,129155,97734,97087,92154,94513,83535,70333,62830,72978,78599,88340,100525.067223989]
["Permanente",null,null,null,62861,50199,47884,45184,47219,43895,40944,38252,41369,48493,57027,59807.75]
["Eventual",null,null,null,63166,45123,46911,44871,44363,37141,27441,22726,27621,24918,27202,30350.128885332]
[]
["POPULAÇÃO AGRÍCOLA FAMILIAR (nº)"]
["Portugal",null,null,null,1974808,1558036,1393426,1252513,1236214,1025218,869311,726290,793169,674573,627825,665571]
[" Continente",null,null,null,1799736,1408613,1261088,1133401,1123418,935316,787102,656296,709928,604926,564670,599497]
["Entre Douro e Minho",null,null,null,466783,345726,306268,274338,248443,203845,175226,145511,150588,124339,110068,114401]
["Trás-os-Montes",null,null,null,255688,227653,212261,198007,196960,174969,155729,138630,151529,138731,132411,143317]
["Beira Litoral",null,null,null,426328,325453,286032,251190,246329,197024,168002,133515,134174,106486,103862,106829]
["Beira Interior",null,null,null,163719,129743,118858,109048,121920,101031,83230,68638,78470,73147,65889,72361]
["Ribatejo e Oeste",null,null,null,295495,229219,202173,176355,170116,140110,106022,84673,96111,76290,70309,76016]
["Alentejo",null,null,null,121804,95794,88222,83601,91678,79884,65591,57425,69849,61473,56795,59051]
["Algarve",null,null,null,69919,55025,47274,40861,47972,38453,33302,27904,29207,24460,25336,27522]
["  Açores",null,null,null,92351,80338,72289,64008,68340,53674,49514,41070,42481,34670,28094,29143]
[" Madeira",null,null,null,82721,69085,60049,55103,44456,36229,32695,28924,40760,34977,35061,36931]
[]
[" PRODUTORES AGRÍCOLAS (nº)"]
["Homem",null,null,null,501978,401786,365663,332801,314254,269471,235465,197352,204511,173204,162850,183916]
["Mulher",null,null,null,91612,82100,79520,78039,95054,83320,81610,71214,92870,80289,83299,90332]
[]
["Nível etário do Produtor"]
["15 a 44 anos",null,null,null,118986,81305,70383,59150,63791,41942,34074,25567,29806,21783,17541,28220]
["45 a 64 anos",null,null,null,303740,241108,217809,196718,190919,147000,132873,113376,125658,99849,94098,101962]
["65 e mais anos",null,null,null,170864,161472,156991,154974,154598,163850,150129,129623,141917,131861,134510,144066]
[]
["Nível de escolaridade do produtor"]
["Nenhum",null,null,null,279917,210453,182488,161379,140706,115378,92794,68263,65691,47154,40090,29036]
["Básico",null,null,null,289512,251559,248154,234718,249281,218571,206237,184128,206156,177468,175848,192367]
["Secundário",null,null,null,17743,15004,6636,7192,8929,8735,7883,7096,12446,14815,15939,27203]
["Superior",null,null,null,6418,6871,7904,7552,10392,10105,10161,9080,13088,14056,14273,25642]
[]
["Formação agrícola do Produtor"]
["Exclusivamente prática",null,null,null,"n.d.",471249,431636,394348,385824,322764,282414,235646,265121,214539,134062,145391]
["Curso F.Prof. relacionados c/ activ. agrícola",null,null,null,"n.d.",11038,11886,14804,20604,27181,31852,30616,29322,35477,108949,123958]
["Completa (secundário ou superior agrícola)",null,null,null,"n.d.",1598,1661,1688,2880,2846,2809,2304,2938,3477,3138,4899]
["(1) Inclui culturas sucessivas e sob coberto de permanentes"]
["(2) inclui pastagens sob coberto de permanentes"]

{"sheet":"Indice","index":1,"n_rows":33,"n_cols":13,"rows_kept":33,"cut":false,"hidden":false,"merged":[]}
[]
[]
[]
[]
[]
[]
[]
[]
[]
[null,"Evolução Estrutural das Explorações Agrícolas do Continente 1989 - 2019"]
[]
[]
[null,null,null,null,null,null,null,null,null,null,null,null,"Acesso aos dados:"]
[]
[]
[]
[]
[]
[]
[]
[]
[]
[]
[]
[]
[]
[]
[]
[]
["Fonte"]
[]
[null,"Recenseamento Agrícola 1989, 1999, 2009, 2019"]
[null,"Inquérito à Estrutura das Explorações Agrícolas 1993, 1995, 1997, 2003, 2005, 2007, 2013, 2016"]

{"sheet":"Continente","index":2,"n_rows":157,"n_cols":16,"rows_kept":157,"cut":false,"hidden":true,"merged":[[58,0,58,3],[0,0,0,3],[1,0,1,3],[16,0,16,3],[23,0,23,3],[45,0,45,3],[61,0,61,3],[69,0,69,3],[70,0,70,3],[107,0,107,3],[124,0,124,3],[74,0,74,3]]}
["Continente",null,null,null,1989,1993,1995,1997,1999,2003,2005,2007,2009,2013,2016,2019]
["EXPLORAÇÕES (nº)"]
["Continente",null,null,null,550879,446146,412064,381793,382163,330656,297046,251547,278114,240527,235774,266039]
["Entre Douro e Minho",null,null,null,111505,86967,79916,73048,67546,58757,52696,45848,49037,41601,39651,44560]
["Trás-os-Montes",null,null,null,80551,75678,72248,70098,70006,64963,61649,56339,61804,57224,56228,65211]
["Beira Litoral",null,null,null,125307,97459,88547,80217,79806,66060,58823,47542,49424,38356,39462,44245]
["Beira Interior",null,null,null,60386,49533,45878,42841,48313,40788,35749,30357,33763,30862,29065,33617]
["Ribatejo e Oeste",null,null,null,99938,78609,71430,64874,61615,52375,43850,33225,39875,31450,31217,34486]
["Alentejo",null,null,null,47049,37491,36114,34722,35906,31830,29558,26032,31828,29478,28424,31131]
["Algarve",null,null,null,26143,20409,17931,15993,18971,15883,14721,12204,12383,11556,11728,12789]
[]
["Explorações por Classe de SAU (nº)"]
["> 0 a <5 ha",null,null,null,446184,343780,311525,286550,296010,249826,218948,179656,207062,170929,165331,189254]
["5 a 50 ha",null,null,null,91424,91810,89783,84931,73258,69253,66865,61534,59667,58536,58861,60776]
["> 50 ha",null,null,null,9050,9287,9601,9340,9612,9393,9971,9485,10047,10249,10395,12084]
[]
["SUPERFÍCIE TOTAL DAS EXPLORAÇÕES (ha)"]
["Continente",null,null,null,5157213,4999731,4929405,4800054,5039569,4719438,4632024,4272503,4571531,4492242,4515890,4987658]
["Superfície agrícola utilizada",null,null,null,3879579,3821319,3800379,3700161,3736140,3578034,3552347,3357019,3542305,3517740,3513006,3838708]
["Matas e florestas sem culturas sob-coberto",null,null,null,965676,867336,803967,801053,997497,878078,838801,707750,837431,800482,822722,960040]
["Superfície agrícola não utilizada",null,null,null,243534,215329,218610,208216,201084,180743,158346,134587,125283,99394,96491,90171]
["Outras superfícies",null,null,null,68425,95747,106448,90624,104848,82584,82531,73146,66512,74626,83671,98739]
[]
["SAU (ha)"]
["Continente",null,null,null,3879579,3821319,3800379,3700161,3736140,3578034,3552347,3357019,3542305,3517740,3513006,3838708]
["Entre Douro e Minho",null,null,null,289624,257684,239465,243450,215675,233702,232260,220371,211154,214554,198415,212639]
["Trás-os-Montes",null,null,null,489133,493229,495965,462230,457881,467158,473530,474617,432873,432056,454719,450701]
["Beira Litoral",null,null,null,231458,220532,205702,179896,169779,154781,151949,135986,125436,117387,122929,129848]
["Beira Interior",null,null,null,433947,443745,441138,435052,418977,390252,384005,352257,337031,341976,356488,391754]
["Ribatejo e Oeste",null,null,null,456544,498887,483831,494427,447853,381558,412093,349237,391006,370390,378010,409095]
["Alentejo",null,null,null,1842094,1766678,1800535,1757360,1924043,1836215,1792285,1721795,1956508,1949142,1906874,2144066]
["Algarve",null,null,null,136779,140565,133743,127745,101932,114368,106225,102756,88297,92234,95570,100605]
[]
["SAU por Classe de SAU"]
["<5 ha",null,null,null,731458,625118,574760,527529,513791,463738,401651,335945,382341,325926,318159,353291]
["5 a 50 ha",null,null,null,1090803,1133878,1126281,1070249,928258,891107,860460,805855,777505,797420,798835,823120]
["> 50 ha",null,null,null,2057316,2062323,2099337,2102382,2294091,2223188,2290236,2215219,2382459,2394395,2396012,2662297]
[]
["Composição da SAU"]
["Terras aráveis",null,null,null,2330327,2258395,2111584,2082578,1725887,1513900,1228939,1066583,1158805,1081311,1019186,1007264]
["Horta familiar",null,null,null,31765,29826,27176,25574,20965,19274,20712,17830,18991,14473,15690,15719]
["Culturas permanentes",null,null,null,780966,748594,739153,700068,705232,676598,643520,592393,686221,704302,700353,855767]
["Pastagens permanentes",null,null,null,736521,784504,922465,891940,1284056,1368262,1659175,1680214,1678288,1717653,1777776,1959958]
["Das quais Pobres:",null,null,null,343025,294075,317110,364843,872378,1041709,1251051,1266034,1315241,1267891,1381157,1455897]
[]
["Cultura temporárias(1) (ha)"]
["Total",null,null,null,1869929,1667685,1600085,1483750,1378415,1177310,992324,859525,923537,840993,853885,843477]
["Cereais para grão",null,null,null,896507,702538,675457,649423,601003,479372,383912,303307,345556,305390,254957,234530]
["Leguminosas secas para grão",null,null,null,80711,41902,38484,28508,25246,21684,13858,15467,13152,9257,18043,18666]
["Prados temporários",null,null,null,73865,47210,45348,43112,37246,45280,49219,64718,31652,35532,91874,105802]
["Culturas forrageiras",null,null,null,565460,641601,623571,589063,528049,487696,466300,389993,442320,414201,406626,406264]
["Batata",null,null,null,103652,81496,77462,55454,47313,36561,24356,20685,17331,11879,10953,12586]
["Beterraba sacarina",null,null,null,39,0,0,0,7551,5115,7012,2108,0,0,0]
["Culturas industriais",null,null,null,63960,83433,76965,57082,74400,50964,8880,17473,24764,19007,19837,10507]
["Culturas hortícolas",null,null,null,61709,51305,54492,50161,49708,42286,36000,37519,46367,41205,47268,50509]
["Flores e plantas ornamentais",null,null,null,633,841,813,1077,1004,1195,1375,1614,1525,2588,1265,1828]
["Outras culturas temporárias",null,null,null,23393,17358,7491,9870,6889,7157,1413,6641,870,1934,3063,2786]
[]
["Pousio (ha)",null,null,null,830303,921836,809120,858969,562646,517973,373654,325044,341465,333031,251744,224368]
["Superfície cultivada",null,null,null,{"$f":"+E19-E44-E59","v":2706251},{"$f":"+F19-F44-F59","v":2605408},{"$f":"+G19-G44-G59","v":2674149},2476349,2301116,2018352,1927642,1765941,1885599,1916818,1880105,{"$f":"+P19-P44-P59","v":2158443}]
[]
["CULTURAS PERMANENTES (ha)",null,null,null,{"$f":"SUM(E63:E69)","v":780966},{"$f":"SUM(F63:F69)","v":748595},739153,700067,705232,676599,643519,592392,686221,704303,700351,855767]
["Frutos frescos (excepto citrinos)",null,null,null,75715,76218,70493,62439,52342,46465,40230,36800,39746,42667,46515,51292]
["Citrinos",null,null,null,25598,25089,23890,23557,22428,19802,19101,18083,16389,17424,17709,19146]
["Frutos sub-tropicais",null,null,null,1042,1297,1122,1094,1197,1038,1390,1469,1764,2412,3525,6145]
["Frutos de casca rija",null,null,null,73738,69964,71345,74698,80281,72820,70951,68877,114980,139750,142523,228487]
["Olival",null,null,null,340514,321675,330337,308731,335028,324061,317046,292162,335841,340284,325755,377234]
["Vinha",null,null,null,262025,252015,239722,227375,211821,210314,192846,172765,175773,160424,160674,171111]
["Outras culturas permanentes",null,null,null,2334,2337,2244,2173,2135,2099,1955,2236,1728,1342,3650,2351]
[]
["PRADOS E PASTAGENS PERMANENTES (2) (ha)",null,null,null,754825,808586,950879,919058,1331033,1419417,1706263,1723221,1721587,1773304,1828714,2003795]
["(1) Inclui culturas sucessivas e sob coberto de permanentes"]
["(2) inclui pastagens sob coberto de permanentes"]
[]
["Sueprfície irrigável",null,null,null,1989,1993,1995,1997,1999,2003,2005,2007,2009,2013,2016,2019]
["Continente",null,null,null,871590,826628,789727,791355,787236,null,613209,580164,536127,547119,543745,626820]
["Entre Douro e Minho",null,null,null,225517,206876,189320,186069,148305,null,118667,115633,94829,106476,90938,91281]
["Trás-os-Montes",null,null,null,99854,115563,113943,112582,93101,null,67215,53153,46666,46675,43953,42658]
["Beira Litoral",null,null,null,143821,137292,121984,108008,104609,null,82996,76595,61116,57133,56385,55615]
["Beira Interior",null,null,null,112734,95693,84986,88021,92717,null,69918,61928,49580,38008,45571,55897]
["Ribatejo e Oeste",null,null,null,144692,143313,145815,146604,154509,null,109076,116336,112539,111985,114330,126084]
["Alentejo",null,null,null,110753,93551,99870,115652,163983,null,140376,136856,155123,169573,175410,232627]
["Algarve",null,null,null,34218,34340,33809,34419,30012,null,24962,19663,16274,17269,17158,22658]
[]
["Efetivos (Cabeças Normais)"]
["  Continente",null,null,null,2244750,2172008,2153381,2137756,2326716,2141186,1870284,1818513,1986998,1821369,2003127,2267450]
["Entre Douro e Minho",null,null,null,388240,362528,370666,355515,338093,312049,264036,252849,262882,250374,250272,237876]
["Trás-os-Montes",null,null,null,171436,149289,155925,156310,146251,128966,113109,111591,105501,100703,131956,94804]
["Beira Litoral",null,null,null,451737,429439,420307,409316,421915,377544,347084,322546,340199,276747,323201,418735]
["Beira Interior",null,null,null,153055,141195,144140,146145,139043,131171,112322,106514,107103,103087,108232,132886]
["Ribatejo e Oeste",null,null,null,578619,613489,566832,557618,660006,585432,441481,437883,510485,456473,506302,658868]
["Alentejo",null,null,null,446631,437198,458583,477532,581052,569037,566410,561773,641608,614835,664301,707171]
["Algarve",null,null,null,55033,38870,36926,35320,40358,36983,25841,25357,19222,19149,18863,17112]
[]
[]
["Efetivos (Cabeças Normais)"]
["  Continente",null,null,null,2244750,2172008,2153381,2137756,2326716,2141186,1870284,1818513,1986998,1821369,2003127,2267450]
["Por Espécie"]
["Equideos",null,null,null,112690,88753,81551,75016,72435,60874,46866,39804,42594,36843,32460,30384]
["Bovinos",null,null,null,869750,782593,858047,825150,845530,835827,783377,776740,840627,816716,917913,906929]
["Ovinos",null,null,null,291204,276866,276623,272575,291772,267620,252600,233457,221117,205730,219001,217175]
["Caprinos",null,null,null,69747,59248,56611,53442,51902,42583,43191,37950,40563,36943,37850,35946]
["Aves",null,null,null,326654,332315,310583,323692,478407,423382,301785,311728,392820,301723,368668,566045]
["Suínos",null,null,null,565212,624125,562408,581231,579978,504746,437229,414078,444066,420122,425140,507671]
["Coelhos",null,null,null,9493,8108,7558,6650,6692,6154,5236,4756,5211,3292,2095,3300]
[]
[null,null,null,null,1989,1993,1995,1997,1999,2003,2005,2007,2009,2013,2016,2019]
["VOLUME DE TRABALHO (UTA)"]
["Continente",null,null,null,810005,576661,551197,492999,497537,431521,376370,319369,341502,304677,295316,293236]
["Entre Douro e Minho",null,null,null,218450,153824,150023,127545,122487,103124,88050,74273,78758,68404,58000,56658]
["Trás-os-Montes",null,null,null,99162,81023,81412,73226,81566,77400,67260,65072,69330,68998,71193,62774]
["Beira Litoral",null,null,null,188075,127288,121948,105164,107553,88993,79738,59518,65502,48669,46289,47053]
["Beira Interior",null,null,null,85447,52671,47625,46443,49193,44165,42588,33624,33552,30355,26215,27098]
["Ribatejo e Oeste",null,null,null,126898,93835,89504,83768,75630,63629,50047,42447,47269,40832,38663,41752]
["Alentejo",null,null,null,61913,48043,43524,42942,44162,40862,35491,32918,35659,35617,41838,44182]
["Algarve",null,null,null,30061,19976,17161,13911,16946,13348,13197,11515,11432,11801,13117,13720]
[]
["Tipo de Mão-de-Obra"]
["Mão-de-obra agrícola familiar",null,null,null,687485,484712,460220,406351,408224,352376,309759,260110,272783,230012,212771,196990]
["Produtor",null,null,null,311206,231524,221960,200648,206241,180870,163899,138618,147342,123072,116335,109949]
["Mão-de-obra agrícola não familiar",null,null,null,122520,91948,90977,86647,89313,79145,66611,59258,68718,74664,82545,96246]
["Permanente",null,null,null,58932,46524,44232,41976,43962,40758,38402,35820,38960,46010,52488,57110]
["Eventual",null,null,null,60565,43112,44590,42655,42525,35967,26351,21677,26000,23795,26093,28990]
[]
["POPULAÇÃO AGRÍCOLA (nº)"]
["Continente",null,null,null,1799736,1408613,1261088,1133401,1123418,935316,787102,656296,709928,604926,564670,599497]
["Entre Douro e Minho",null,null,null,466783,345726,306268,274338,248443,203845,175226,145511,150588,124339,110068,114401]
["Trás-os-Montes",null,null,null,255688,227653,212261,198007,196960,174969,155729,138630,151529,138731,132411,143317]
["Beira Litoral",null,null,null,426328,325453,286032,251190,246329,197024,168002,133515,134174,106486,103862,106829]
["Beira Interior",null,null,null,163719,129743,118858,109048,121920,101031,83230,68638,78470,73147,65889,72361]
["Ribatejo e Oeste",null,null,null,295495,229219,202173,176355,170116,140110,106022,84673,96111,76290,70309,76016]
["Alentejo",null,null,null,121804,95794,88222,83601,91678,79884,65591,57425,69849,61473,56795,59051]
["Algarve",null,null,null,69919,55025,47274,40861,47972,38453,33302,27904,29207,24460,25336,27522]
[]
[" PRODUTORES AGRÍCOLAS (nº)"]
["Homem",null,null,null,462535,368061,335627,306245,289291,248858,216600,180885,186194,156995,147962,168459]
["Mulher",null,null,null,83534,73350,71413,70052,86647,75665,73896,64395,84313,72973,75543,82156]
[]
["Nível etário do Produtor"]
["15 a 44 anos",null,null,null,107122,72074,62146,51852,55538,35871,29417,21858,24403,17842,14914,24151]
["45 a 64 anos",null,null,null,282161,222105,201020,181582,176575,134653,120906,102461,112932,88447,83576,90767]
["65 e mais anos",null,null,null,156786,147232,143874,142863,143825,154000,140172,120960,133172,123680,125015,135697]
[]
["Nível de escolaridade do produtor"]
["Nenhum",null,null,null,255187,190085,165348,146863,129360,105666,84731,61900,60040,43102,36127,26704]
["Básico",null,null,null,268772,231253,228016,215583,228474,201224,188739,168350,186768,159711,158991,174793]
["Secundário/Pós-secundário",null,null,null,16041,13567,6143,6635,8230,7980,7338,6476,11361,13784,14755,25017]
["Superior",null,null,null,6069,6507,7533,7216,9874,9653,9687,8554,12338,13372,13633,24101]
[]
["Formação agrícola do Produtor"]
["Exclusivamente prática",null,null,null,"n.d.",429831,394406,360809,353898,295947,257273,213773,240285,194177,118615,131980]
["Curso F.Prof. relacionados c/ activ. agrícola",null,null,null,"n.d.",10069,11031,13838,19273,25820,30494,29272,27400,32515,101819,113974]
["Completa (secundário ou superior agrícola)",null,null,null,"n.d.",1511,1603,1650,2767,2756,2729,2234,2822,3277,3073,4661]
["(1) Inclui culturas sucessivas e sob coberto de permanentes"]
["(2) inclui pastagens sob coberto de permanentes"]
[null,null,null,null,{"$f":"+(E147+E148)/SUM(E145:E148)*100","v":4.0489388703625364}]
[null,null,null,null,{"$f":"+(E147+E148)/E3*100","v":4.0135855605314417}]

{"sheet":"1989","index":3,"n_rows":85,"n_cols":10,"rows_kept":85,"cut":false,"hidden":true,"merged":[[35,0,35,1],[0,0,0,1],[1,0,1,1],[6,0,6,1],[23,0,23,1],[38,0,38,1],[46,0,46,1],[59,0,59,1],[66,0,66,1],[85,0,85,1]]}
[1989,null,"Continente","EDM","TM","BL","BI","LVT","ALE","ALG"]
["EXPLORAÇÕES (nº)",null,550879,111505,80551,125307,60386,99938,47049,26143]
["Explorações por Classe de SAU (nº)"]
["> 0 a <5 ha",null,446184,101131,52952,118763,45225,83508,24909,19696]
["5 a 50 ha",null,91424,9925,26845,6156,14065,14154,14286,5993]
["> 50 ha",null,9050,128,660,62,1030,912,6039,219]
["SUPERFÍCIE TOTAL DAS EXPLORAÇÕES (ha)",null,5157213,464133,646279,425922,654570,684184,2007281,274845]
["Superfície agrícola utilizada",null,3879579,289624,489133,231458,433947,456544,1842094,136779]
["Matas e florestas sem culturas sob-coberto",null,965676,160966,73494,180590,168428,200065,124548,57585]
["Superfície agrícola não utilizada",null,243534,6418,70570,7357,47225,16262,17216,78486]
["Outras superfícies",null,68425,7126,13082,6517,4970,11313,23423,1995]
["SAU (ha)",null,3879579,289624,489133,231458,433947,456544,1842094,136779]
["SAU por Classe de SAU"]
["<5 ha",null,731458,161763,106275,167716,85372,128885,47458,33989]
["5 a 50 ha",null,1090803,81260,322576,55156,173795,160121,226550,71347]
["> 50 ha",null,2057316,46600,60282,8587,174780,167538,1568086,31444]
["Composição da SAU"]
["Terras aráveis",null,2330327,176575,222025,153148,215620,221287,1278436,63237]
["Horta familiar",null,31765,3816,8003,6505,5938,3593,2562,1348]
["Culturas permanentes",null,780966,45160,178449,56460,100177,171795,169037,59888]
["Pastagens permanentes",null,736521,64072,80656,15345,112212,59870,392059,12306]
["     Das quais Pobres:",null,343025,39897,24813,5652,76852,16894,172627,6288]
[]
["CULTURAS TEMPORÁRIAS(1) (ha)"]
["Total",null,1869929,349411,184551,233010,189099,213333,660920,39606]
["Cereais para grão",null,896507,86367,110916,82590,81866,86699,424335,23734]
["Leguminosas secas para grão",null,80711,36503,2662,18789,8797,4804,6215,2942]
["Prados temporários",null,73865,17200,1974,2806,10970,10646,28544,1725]
["Culturas forrageiras",null,565460,164798,42634,96883,70781,59329,127413,3622]
["Batata",null,103652,19266,25778,26106,14276,14918,1742,1566]
["Beterraba sacarina",null,39,0,0,1,3,34,0,0]
["Culturas industriais",null,63960,68,100,384,1075,3267,58997,70]
["Culturas hortícolas",null,61709,4304,438,4429,881,32789,13136,5733]
["Flores e plantas ornamentais",null,633,144,2,65,7,342,5,68]
["Outras culturas temporárias",null,23393,20760,48,956,444,504,533,147]
["Pousio (ha)",null,830303,495,61746,4209,58943,31129,645844,27938]
["SUPERFÚICIE CULTIVADA",null,{"$f":"+C8-C22-C36","v":2706251},{"$f":"+D8-D22-D36","v":249232},402574,221597,298152,408521,1023623,102553]
[]
["CULTURAS PERMANENTES (ha)"]
["Frutos frescos (excepto citrinos)",null,75715,2709,7985,4457,10215,38857,5275,6217]
["Citrinos",null,25598,937,483,851,593,4391,3560,14783]
["Frutos sub-tropicais",null,1042,621,5,138,30,62,58,128]
["Frutos de casca rija",null,73738,297,38399,876,5065,605,1886,26610]
["Olival",null,340514,2660,61744,15439,59300,48725,144957,7689]
["Vinha",null,262025,37809,69743,33558,24865,78826,12777,4448]
["Outras culturas permanentes",null,2334,128,90,1142,109,328,525,13]
["PRADOS E PASTAGENS PERMANENTES (2) (ha)",null,754825,65233,82171,16207,113429,65049,398617,14120]
["SUPERFÍCIE IRRIGÁVEL",null,871590,225517,99854,143821,112734,144692,110753,34218]
[]
["Efetivos (Cabeças Normais)",null,2244750,388240,171436,451737,153055,578619,446631,55033]
["Por Espécie"]
["Equideos",null,112690,4096,39131,12770,22747,13334,12979,7632]
["Bovinos",null,869750,277599,66415,162070,48806,117524,181308,16029]
["Ovinos",null,291204,13369,28970,19594,36636,35207,150531,6897]
["Caprinos",null,69747,8006,11637,11099,13954,8198,14061,2792]
["Aves",null,326654,45834,7988,121503,10989,127110,8070,5160]
["Suínos",null,565212,36559,16522,122197,19253,275019,79325,16337]
["Coelhos",null,9493,2777,773,2504,670,2227,357,186]
[]
["VOLUME DE TRABALHO (UTA)",null,810005,218450,99162,188075,85447,126898,61913,30061]
["Tipo de Mão-de-Obra"]
["Mão-de-obra agrícola familiar",null,687485,199995,79175,174620,76041,97431,34695,25529]
["Produtor",null,311206,77518,39038,71686,37326,50633,20764,14240]
["Mão-de-obra agrícola não familiar",null,122520,18455,19987,13454,9406,29467,27218,4533]
["Permanente",null,58932,8791,6992,5213,3057,15072,16894,2913]
["Eventual",null,60565,9149,12318,7763,6078,13893,9852,1512]
["POPULAÇÃO AGRÍCOLA (nº)",null,1799736,466783,255688,426328,163719,295495,121804,69919]
[" PRODUTORES AGRÍCOLAS (nº)"]
["Homem",null,462535,84012,67120,107945,51559,89002,40660,22237]
["Mulher",null,83534,26802,12934,17034,8576,9498,5046,3644]
["Nível etário do Produtor"]
["15 a 44 anos",null,107122,26302,15660,27835,8216,18524,7603,2982]
["45 a 64 anos",null,282161,58131,40492,67177,28148,52932,22913,12368]
["65 e mais anos",null,156786,26381,23902,29967,23771,27044,15190,10531]
["Nível de escolaridade do produtor"]
["Nenhum",null,255187,54217,39205,51342,31037,42312,22884,14190]
["Básico",null,268772,53391,37143,69879,26847,51420,19758,10334]
["Secundário/Pós-secundário",null,16041,2191,2556,2919,1587,3622,2145,1021]
["Superior",null,6069,1015,1150,839,664,1146,919,336]
["Formação agrícola do Produtor"]
["Exclusivamente prática",null,"n.d.","n.d.","n.d.","n.d.","n.d.","n.d.","n.d.","n.d."]
["Curso F.Prof. relacionados c/ activ. agrícola",null,"n.d.","n.d.","n.d.","n.d.","n.d.","n.d.","n.d.","n.d."]
["Completa (secundário ou superior agrícola)",null,"n.d.","n.d.","n.d.","n.d.","n.d.","n.d.","n.d.","n.d."]
["(1) Inclui culturas sucessivas e sob coberto de permanentes"]
["(2) inclui pastagens sob coberto de permanentes"]

{"sheet":"1999","index":4,"n_rows":85,"n_cols":10,"rows_kept":85,"cut":false,"hidden":true,"merged":[[38,0,38,1],[46,0,46,1],[59,0,59,1],[66,0,66,1],[0,0,0,1],[1,0,1,1],[6,0,6,1],[23,0,23,1],[35,0,35,1]]}
[1999,null,"Continente","EDM","TM","BL","BI","LVT","ALE","ALG"]
["EXPLORAÇÕES (nº)",null,382163,67546,70006,79806,48313,61615,35906,18971]
["Explorações por Classe de SAU (nº)"]
["> 0 a <5 ha",null,296010,60380,46124,74145,36091,48148,17140,13982]
["5 a 50 ha",null,73258,6830,22984,5061,10857,11370,11529,4627]
["> 50 ha",null,9612,152,722,88,1231,1027,6205,187]
["SUPERFÍCIE TOTAL DAS EXPLORAÇÕES (ha)",null,5039569,374832,637104,316646,618526,706000,2158882,227578]
["Superfície agrícola utilizada",null,3736140,215675,457881,169779,418977,447853,1924043,101932]
["Matas e florestas sem culturas sob-coberto",null,997497,133236,101797,131795,160471,220126,189789,60284]
["Superfície agrícola não utilizada",null,201084,7745,61925,8142,31543,15374,14158,62196]
["Outras superfícies",null,104848,18176,15501,6930,7535,22647,30892,3166]
["SAU (ha)",null,3736140,215675,457881,169779,418977,447853,1924043,101932]
["SAU por Classe de SAU"]
["<5 ha",null,513791,97140,96078,111917,65446,84106,33707,25397]
["5 a 50 ha",null,928258,64978,287293,50293,144511,136405,190137,54642]
["> 50 ha",null,2294091,53557,74510,7569,209020,227342,1700200,21893]
["Composição da SAU"]
["Terras aráveis",null,1725887,106780,152660,99158,152390,204970,975840,34090]
["Horta familiar",null,20965,2627,5473,4479,3585,2750,1265,788]
["Culturas permanentes",null,705232,35529,192795,48292,93058,117592,161657,56309]
["Pastagens permanentes",null,1284056,70739,106953,17850,169945,122542,785282,10746]
["     Das quais Pobres:",null,872378,60529,48793,8266,130180,29986,585295,9328]
[]
["CULTURAS TEMPORÁRIAS(1) (ha)"]
["Total",null,1378415,201585,115365,144367,149942,182744,564221,20190]
["Cereais para grão",null,601003,44914,57288,51856,41645,70617,325832,8852]
["Leguminosas secas para grão",null,25246,5274,1153,6390,1641,1940,8031,817]
["Prados temporários",null,37246,7910,2608,2620,2332,8214,12756,807]
["Culturas forrageiras",null,528049,126449,40588,67414,96213,55044,136253,6087]
["Batata",null,47313,7096,13094,11490,4733,9377,863,660]
["Beterraba sacarina",null,7551,0,0,211,2,4333,2906,100]
["Culturas industriais",null,74400,31,58,377,2793,3727,67301,113]
["Culturas hortícolas",null,49708,3726,516,3504,501,28920,9975,2566]
["Flores e plantas ornamentais",null,1004,225,45,171,5,370,122,66]
["Outras culturas temporárias",null,6889,5955,16,332,77,203,181,125]
["Pousio (ha)",null,562646,459,50162,2874,30744,33820,429328,15259]
["SUPERFÚICIE CULTIVADA",null,{"$f":"+C8-C22-C36","v":2301116},{"$f":"+D8-D22-D36","v":154687},358926,158639,258053,384047,909420,77345]
[]
["CULTURAS PERMANENTES (ha)"]
["Frutos frescos (excepto citrinos)",null,52342,1868,9051,3563,6769,24614,2686,3791]
["Citrinos",null,22428,696,585,631,415,2789,2188,15124]
["Frutos sub-tropicais",null,1197,780,4,173,4,12,7,217]
["Frutos de casca rija",null,80281,674,46334,996,4276,746,1997,25258]
["Olival",null,335028,1126,72288,17585,60325,36829,138084,8791]
["Vinha",null,211821,30231,64294,24494,21148,52084,16580,2991]
["Outras culturas permanentes",null,2135,154,239,850,121,519,115,138]
["PRADOS E PASTAGENS PERMANENTES (2) (ha)",null,1331033,71533,107673,19896,175831,126077,818302,11721]
["SUPERFÍCIE IRRIGÁVEL",null,787236,148305,93101,104609,92717,154509,163983,30012]
[]
["Efetivos (Cabeças Normais)",null,2326716,338093,146251,421915,139043,660006,581052,40358]
["Por Espécie"]
["Equideos",null,6692,1686,837,2140,585,1168,200,76]
["Bovinos",null,845530,239711,56678,113204,41015,109057,277601,8264]
["Ovinos",null,291772,14088,32552,18973,45379,26324,147634,6822]
["Caprinos",null,51902,6620,7352,8247,10796,4656,11995,2235]
["Aves",null,478407,39716,8245,151940,9963,245489,19904,3151]
["Suínos",null,579978,30283,16149,120378,18367,264957,113608,16238]
["Coelhos",null,72435,5989,24438,7033,12938,8355,10110,3572]
[]
["VOLUME DE TRABALHO (UTA)",null,497537,122487,81566,107553,49193,75630,44162,16946]
["Tipo de Mão-de-Obra"]
["Mão-de-obra agrícola familiar",null,408224,109319,64975,98414,42453,54397,25021,13644]
["Produtor",null,206241,49181,32538,47351,23008,30023,16051,8090]
["Mão-de-obra agrícola não familiar",null,89313,13168,16591,9139,6740,21233,19140,3302]
["Permanente",null,43962,6661,5481,4136,2476,11312,11835,2061]
["Eventual",null,42525,6011,10408,4626,4017,9488,6825,1151]
["POPULAÇÃO AGRÍCOLA (nº)",null,1123418,248443,196960,246329,121920,170116,91678,47972]
[" PRODUTORES AGRÍCOLAS (nº)"]
["Homem",null,289291,43726,53202,59607,37508,51358,28585,15305]
["Mulher",null,86647,22854,15906,19659,10431,8586,5860,3351]
["Nível etário do Produtor"]
["15 a 44 anos",null,55538,12072,11302,11420,5351,8634,5160,1599]
["45 a 64 anos",null,176575,32688,31594,41748,19752,28663,14461,7669]
["65 e mais anos",null,143825,21820,26212,26098,22836,22647,14824,9388]
["Nível de escolaridade do produtor"]
["Nenhum",null,129360,25418,24504,24106,18637,17708,11695,7292]
["Básico",null,228474,38733,40869,52845,27146,39050,19561,10270]
["Secundário/Pós-secundário",null,8230,1035,1485,1130,922,1708,1366,584]
["Superior",null,9874,1394,2250,1185,1234,1478,1823,510]
["Formação agrícola do Produtor"]
["Exclusivamente prática",null,353898,60957,65599,76051,46362,55260,31948,17721]
["Curso F.Prof. relacionados c/ activ. agrícola",null,19273,5359,3038,2980,1323,4106,1670,797]
["Completa (secundário ou superior agrícola)",null,2767,264,471,235,254,578,827,138]
["(1) Inclui culturas sucessivas e sob coberto de permanentes"]
["(2) inclui pastagens sob coberto de permanentes"]

{"sheet":"2009","index":5,"n_rows":85,"n_cols":10,"rows_kept":85,"cut":false,"hidden":true,"merged":[[38,0,38,1],[46,0,46,1],[59,0,59,1],[66,0,66,1],[0,0,0,1],[1,0,1,1],[6,0,6,1],[23,0,23,1],[35,0,35,1]]}
[2009,null,"Continente","EDM","TM","BL","BI","LVT","ALE","ALG"]
["EXPLORAÇÕES (nº)",null,278114,49037,61804,49424,33763,39875,31828,12383]
["Explorações por Classe de SAU (nº)"]
["> 0 a <5 ha",null,207062,42732,41227,44966,24855,29979,14706,8597]
["5 a 50 ha",null,59667,5943,19750,4094,7693,8464,10184,3539]
["> 50 ha",null,10047,191,735,101,1179,1095,6535,211]
["SUPERFÍCIE TOTAL DAS EXPLORAÇÕES (ha)",null,4571531,312756,619172,222136,503126,543222,2205930,165189]
["Superfície agrícola utilizada",null,3542305,211154,432873,125436,337031,391006,1956508,88297]
["Matas e florestas sem culturas sob-coberto",null,837431,91139,141138,87108,133621,133716,204104,46605]
["Superfície agrícola não utilizada",null,125283,3543,40223,5822,24674,8331,14593,28096]
["Outras superfícies",null,66512,6920,4937,3770,7800,10169,30724,2191]
["SAU (ha)",null,3542305,211154,432873,125436,337031,391006,1956508,88297]
["SAU por Classe de SAU"]
["<5 ha",null,382341,73356,88640,71587,46245,56041,29656,16815]
["5 a 50 ha",null,777505,62390,239503,44853,105715,109168,170840,45036]
["> 50 ha",null,2382459,75409,104729,8995,185071,225797,1756013,26446]
["Composição da SAU"]
["Terras aráveis",null,1158805,85759,101615,70547,100001,166379,612176,22327]
["Horta familiar",null,18991,3181,5030,4557,2476,1944,1176,628]
["Culturas permanentes",null,686221,26932,191614,33979,74049,93628,221013,45007]
["Pastagens permanentes",null,1678288,95282,134614,16353,160505,129055,1122142,20335]
["     Das quais Pobres:",null,1315241,82563,78774,6355,122438,67575,939771,17766]
[]
["CULTURAS TEMPORÁRIAS(1) (ha)"]
["Total",null,923537,139237,66830,85425,92269,139840,391742,8193]
["Cereais para grão",null,345556,28895,29404,34150,16630,57035,177223,2219]
["Leguminosas secas para grão",null,13152,1228,442,1674,659,944,8131,73]
["Prados temporários",null,31652,7352,1129,2055,4087,5595,11377,57]
["Culturas forrageiras",null,442320,96712,30413,41545,68779,37842,162639,4390]
["Batata",null,17331,2059,4927,2923,1321,5592,347,162]
["Beterraba sacarina",null,0,0,0,0,0,0,0,0]
["Culturas industriais",null,24764,22,26,110,383,1098,23119,6]
["Culturas hortícolas",null,46367,2542,438,2749,309,31089,8214,1026]
["Flores e plantas ornamentais",null,1525,317,31,142,6,467,414,147]
["Outras culturas temporárias",null,870,110,20,77,95,177,278,113]
["Pousio (ha)",null,341465,3851,40585,5787,18995,32180,225721,14346]
["SUPERFÚICIE CULTIVADA",null,{"$f":"+C8-C22-C36","v":1885599},{"$f":"+D8-D22-D36","v":124740},313514,113294,195598,291251,791016,56185]
[]
["CULTURAS PERMANENTES (ha)"]
["Frutos frescos (excepto citrinos)",null,39746,1666,7754,1929,5999,16567,2477,3355]
["Citrinos",null,16389,451,472,307,248,1525,1852,11533]
["Frutos sub-tropicais",null,1764,1161,8,316,4,8,10,257]
["Frutos de casca rija",null,114980,982,46920,890,4319,12295,29528,20046]
["Olival",null,335841,881,75266,14341,47336,25540,164078,8399]
["Vinha",null,175773,21708,60907,15467,16076,37220,22998,1396]
["Outras culturas permanentes",null,1728,82,288,728,67,473,69,21]
["PRADOS E PASTAGENS PERMANENTES (2) (ha)",null,1721587,95992,134964,17779,164528,133477,1153264,21584]
["SUPERFÍCIE IRRIGÁVEL",null,536127,94829,46666,61116,49580,112539,155123,16274]
[]
["Efetivos (Cabeças Normais)",null,1986998,262882,105501,340199,107103,510485,641608,19222]
["Por Espécie"]
["Equideos",null,42594,7350,12463,2850,4952,5819,7672,1488]
["Bovinos",null,840627,194015,45498,66640,44718,94524,389893,5338]
["Ovinos",null,221117,12915,26973,14387,35920,17380,109042,4501]
["Caprinos",null,40563,5482,5701,6424,6617,4866,9916,1558]
["Aves",null,392820,27506,7224,156531,6791,187136,6500,1132]
["Suínos",null,444066,13830,6638,91857,7737,200333,118489,5183]
["Coelhos",null,5211,1784,1004,1510,368,427,96,22]
[]
["VOLUME DE TRABALHO (UTA)",null,341502,78758,69330,65502,33552,47269,35659,11432]
["Tipo de Mão-de-Obra"]
["Mão-de-obra agrícola familiar",null,272783,70348,56740,58888,29459,31174,17252,8924]
["Produtor",null,147342,34818,30836,30561,16238,18373,11204,5314]
["Mão-de-obra agrícola não familiar",null,68718,8410,12591,6614,4093,16095,18407,2509]
["Permanente",null,38960,5127,4641,4075,1699,10268,11440,1710]
["Eventual",null,26000,2929,7219,2271,2215,5570,5186,610]
["POPULAÇÃO AGRÍCOLA (nº)",null,709928,150588,151529,134174,78470,96111,69849,29207]
[" PRODUTORES AGRÍCOLAS (nº)"]
["Homem",null,186194,26733,40455,32574,23423,31135,22748,9126]
["Mulher",null,84313,21200,20524,16187,9901,6930,6544,3027]
["Nível etário do Produtor"]
["15 a 44 anos",null,24403,5533,6071,3422,2095,3470,3150,662]
["45 a 64 anos",null,112932,22236,26056,22363,12050,15369,10956,3902]
["65 e mais anos",null,133172,20164,28852,22976,19179,19226,15186,7589]
["Nível de escolaridade do produtor"]
["Nenhum",null,60040,12184,13661,9803,8441,6280,6386,3285]
["Básico",null,186768,32592,41163,36276,21986,28569,18448,7734]
["Secundário/Pós-secundário",null,11361,1434,2707,1404,1353,1815,2058,590]
["Superior",null,12338,1723,3448,1278,1544,1401,2400,544]
["Formação agrícola do Produtor"]
["Exclusivamente prática",null,240285,42159,52780,44420,30639,33040,25886,11361]
["Curso F.Prof. relacionados c/ activ. agrícola",null,27400,5480,7656,4143,2427,4523,2477,694]
["Completa (secundário ou superior agrícola)",null,2822,294,543,198,258,502,929,98]
["(1) Inclui culturas sucessivas e sob coberto de permanentes"]
["(2) inclui pastagens sob coberto de permanentes"]

{"sheet":"2013","index":6,"n_rows":86,"n_cols":10,"rows_kept":86,"cut":false,"hidden":true,"merged":[[38,0,38,1],[46,0,46,1],[60,0,60,1],[67,0,67,1],[0,0,0,1],[1,0,1,1],[6,0,6,1],[11,0,11,1],[23,0,23,1],[35,0,35,1]]}
[2013,null,"Continente","EDM","TM","BL","BI","LVT","ALE","ALG"]
["EXPLORAÇÕES (nº)",null,240527,41601,57224,38356,30862,31450,29478,11556]
["Explorações por Classe de SAU (nº)"]
["> 0 a <5 ha",null,170929,34958,36763,33787,22572,22192,13094,7563]
["5 a 50 ha",null,58536,6311,19446,4255,6991,7880,9880,3774]
["> 50 ha",null,10249,160,947,127,1290,1133,6386,206]
["SUPERFÍCIE TOTAL DAS EXPLORAÇÕES (ha)",null,4492242,305920,629636,201908,481700,500542,2210340,162196]
["Superfície agrícola utilizada",null,3517740,214554,432056,117387,341976,370390,1949142,92234]
["Matas e florestas sem culturas sob-coberto",null,800482,78380,161286,77716,112576,110706,215120,44698]
["Superfície agrícola não utilizada",null,99394,5144,29164,3215,19009,6334,13407,23122]
["Outras superfícies",null,74626,7842,7130,3591,8139,13113,32670,2141]
["SAU (ha)",null,3517740,214554,432056,117387,341976,370390,1949142,92234]
["SAU por Classe de SAU"]
["<5 ha",null,325926,61143,80763,58033,41743,42278,26893,15073]
["5 a 50 ha",null,797420,69368,258028,49189,98498,105269,167569,49499]
["> 50 ha",null,2394395,84042,93265,10165,201736,222843,1754681,27663]
["Composição da SAU"]
["Terras aráveis",null,1081311,82587,104999,68662,85449,153181,561425,25007]
["Horta familiar",null,14473,2125,4492,2442,1974,1684,1297,460]
["Culturas permanentes",null,704302,26924,196735,28914,75155,94697,235239,46638]
["Pastagens permanentes",null,1717653,102918,125829,17369,179399,120829,1151181,20129]
["   Das quais Pobres:",null,1267891,86289,75875,7277,116156,63409,901521,17364]
[]
["Cultura temporárias(1) (ha)"]
["Total",null,840993,130975,65703,81305,70996,129301,350766,11946]
["Cereais para grão",null,305390,21966,31487,28500,12508,54553,154135,2240]
["Leguminosas secas para grão",null,9257,1091,512,1159,245,505,5589,156]
["Prados temporários",null,35532,8171,2442,3117,5029,3836,9283,3655]
["Culturas forrageiras",null,414201,94975,26571,42802,51997,38184,155209,4464]
["Batata",null,11879,1661,3862,1883,639,3612,129,93]
["Beterraba sacarina",null,0,0,0,0,0,0,0,0]
["Culturas industriais",null,19007,196,39,190,4,612,17965,0]
["Culturas hortícolas",null,41205,2369,726,3235,335,26600,6983,958]
["Flores e plantas ornamentais",null,2588,515,38,336,0,978,455,266]
["Outras culturas temporárias",null,1934,31,27,83,238,422,1019,114]
["Pousio (ha)",null,333031,3242,43391,7664,21553,28454,215509,13218]
["Superfície cultivada",null,{"$f":"+C8-C22-C36","v":1916818},{"$f":"+D8-D22-D36","v":125023},312790,102446,204267,278527,832112,61652]
[]
["CULTURAS PERMANENTES (ha)"]
["Frutos frescos (excepto citrinos)",null,42667,2302,10236,1656,6538,15868,1624,4442]
["Citrinos",null,17424,501,733,288,305,1532,1129,12935]
["Frutos sub-tropicais",null,2412,1878,9,352,2,1,0,171]
["Frutos de casca rija",null,139750,1051,48288,1445,9524,15870,44308,19263]
["Olival",null,340284,699,77057,12499,45784,30613,165092,8540]
["Vinha",null,160424,20337,60330,12173,12975,30390,22992,1226]
["Outras culturas permanentes",null,1342,156,82,501,28,421,94,61]
["PRADOS E PASTAGENS PERMANENTES (2) (ha)",null,1773304,103394,126891,17677,185357,125259,1193821,20904]
[]
["Efetivos (Cabeças Normais)"]
["Portugal",null,1821369,250374,100703,276747,103087,456473,614835,19149]
["CN"]
["Por Espécie"]
["Equideos",null,36843,6650,10756,2628,3947,4584,6728,1551]
["Bovinos",null,816716,193870,42182,60109,44317,79053,389824,7361]
["Ovinos",null,205730,10633,27396,12012,33025,14310,104355,3998]
["Caprinos",null,36943,3576,5839,5140,7142,4992,8511,1743]
["Aves",null,301723,24735,6450,120761,5716,139295,3547,1218]
["Suínos",null,420122,9725,7459,75154,8678,214021,101825,3260]
["Coelhos",null,3292,1185,621,943,262,218,45,18]
[]
["VOLUME DE TRABALHO (UTA)",null,304677,68404,68998,48669,30355,40832,35617,11801]
["Tipo de Mão-de-Obra"]
["Mão-de-obra agrícola familiar",null,230012,56991,55496,42261,26354,22919,17836,8157]
["Produtor",null,123072,27905,28757,21678,14192,13422,12087,5030]
["Mão-de-obra agrícola não familiar",null,74664,11413,13502,6409,4001,17914,17781,3644]
["Permanente",null,46010,8194,6074,4260,1851,11310,11645,2675]
["Eventual",null,23795,2805,6195,1630,1983,6254,4243,684]
["POPULAÇÃO AGRÍCOLA (nº)",null,604926,124339,138731,106486,73147,76290,61473,24460]
[" PRODUTORES AGRÍCOLAS (nº)"]
["Homem",null,156996,22063,36440,24726,21188,23642,20900,8036]
["Mulher",null,72973,17778,19486,12737,9111,5370,5301,3189]
["Nível etário do Produtor"]
["15 a 44 anos",null,17842,3378,5005,2283,1828,2485,2352,508]
["45 a 64 anos",null,88447,17231,21972,15332,9617,11098,10021,3175]
["65 e mais anos",null,123680,19232,28947,19848,18855,15429,13828,7542]
["Nível de escolaridade do produtor"]
["Nenhum",null,43102,8087,11103,6563,7110,3940,3916,2383]
["Básico",null,159711,27986,37548,27938,19331,21938,17509,7460]
["Secundário/Pós-secundário",null,13784,1847,3677,1642,1918,1648,2370,682]
["Superior",null,13372,1921,3598,1321,1940,1486,2406,700]
["Formação agrícola do Produtor"]
["Exclusivamente prática",null,194177,32010,46471,32253,27262,23503,22501,10177]
["Curso F.Prof. relacionados c/ activ. agrícola",null,32515,7371,8866,5029,2711,4938,2682,918]
["Completa (secundário ou superior agrícola)",null,3277,460,589,182,327,570,1018,130]
["(1) Inclui culturas sucessivas e sob coberto de permanentes"]
["(2) inclui pastagens sob coberto de permanentes"]

{"sheet":"Evolução Estrutura","index":7,"n_rows":136,"n_cols":21,"rows_kept":136,"cut":false,"hidden":true,"merged":[[0,1,0,17],[6,1,6,17],[38,1,39,18],[24,20,31,26],[15,20,22,26]]}
[null,"Evolução Estrutural das Explorações Agrícolas do Continente"]
[]
[null,"Escolha variável 1",null,null,null,null,"Escolha variável 2",null,null,null,null,null,"Escolha tipo de evolução"]
[]
[]
[]
[null,{"$f":"+\"Evolução comparativa em \" & Sheet1!I69","v":"Evolução comparativa em Índice 100 (IND100=1989)"}]
[]
[]
[]
[]
[]
[]
[]
[null,null,null,null,null,null,null,null,null,null,null,null,null,null,null,null,null,null,null,null,"Conceito Variável 1"]
[null,null,null,null,null,null,null,null,null,null,null,null,null,null,null,null,null,null,null,null,{"$f":"+Sheet1!C69& \"- \" &INDEX(Sheet1!$R$72:$R$135,Sheet1!$D$69)","v":"Superfície Total Das Explorações- Soma da superfície agrícola utilizada, da superfície das matas e florestas sem culturas sob-coberto, da superfície agrícola não utilizada e das outras superfícies da exploração."}]
[]
[]
[]
[]
[]
[]
[]
[null,null,null,null,null,null,null,null,null,null,null,null,null,null,null,null,null,null,null,null,"Conceito Variável 2"]
[null,null,null,null,null,null,null,null,null,null,null,null,null,null,null,null,null,null,null,null,{"$f":"+Sheet1!G69& \" - \" &INDEX(Sheet1!$R$72:$R$135,Sheet1!$H$69)","v":"Superfície cultivada - "}]
[]
[]
[]
[]
[]
[]
[]
[]
[null,null,null,null,null,null,null,null,null,null,null,null,null,null,null,null,null,null,null,"Fonte"]
[]
[null,null,null,null,null,null,null,null,null,null,null,null,null,null,null,null,null,null,null,null,"Recenseamento Agrícola 1989, 1999, 2009"]
[null,null,null,null,null,null,null,null,null,null,null,null,null,null,null,null,null,null,null,null,"Inquérito à Estrutura das Explorações Agrícolas 1993, 1995, 1997, 2003, 2005, 2007, 2013, 2016"]
[]
["Nota:",{"$f":"+INDEX('Evolução Estrutura'!D126:D127,Sheet1!J69)","v":"A área de Superfície Total Das Explorações (ha) em 2019 era 97% do valor de 1989. A área de Superfície cultivada (ha) em 2019 era 80% do valor de 1989."}]
[]
[]
[]
[]
[]
[]
[]
[]
[]
[]
[]
[]
[]
[]
[]
[]
[]
[]
[]
[]
[]
[]
[]
[]
[]
[]
[]
[]
[]
[]
[]
[]
[]
[]
[]
[]
[]
[]
[]
[]
[]
[]
[]
[]
[]
[]
[]
[]
[]
[]
[]
[]
[]
[]
[]
[]
[]
[]
[]
[]
[]
[]
[]
[]
[]
[]
[]
[]
[]
[]
[]
[]
[]
[]
[]
[]
[]
[]
[]
[]
[]
[]
[]
[null,null,null,1989,1993,1995,1997,1999,2003,2005,2007,2009,2013,2016,2019]
[null,null,{"$f":"+INDEX(C129:C130,Sheet1!$J$69) & \" (\" & Sheet1!E69 & \")\"","v":"Superfície Total Das Explorações (ha)"},{"$f":"+INDEX(D129:D130,Sheet1!$J$69)","v":100},{"$f":"+INDEX(E129:E130,Sheet1!$J$69)","v":96.946373942670192},{"$f":"+INDEX(F129:F130,Sheet1!$J$69)","v":95.582730439871298},{"$f":"+INDEX(G129:G130,Sheet1!$J$69)","v":93.074573417851852},{"$f":"+INDEX(H129:H130,Sheet1!$J$69)","v":97.718845430661872},{"$f":"+INDEX(I129:I130,Sheet1!$J$69)","v":91.511403542960124},{"$f":"+INDEX(J129:J130,Sheet1!$J$69)","v":89.816418286388398},{"$f":"+INDEX(K129:K130,Sheet1!$J$69)","v":82.845191773153445},{"$f":"+INDEX(L129:L130,Sheet1!$J$69)","v":88.643439780361987},{"$f":"+INDEX(M129:M130,Sheet1!$J$69)","v":87.106000857439852},{"$f":"+INDEX(N129:N130,Sheet1!$J$69)","v":87.564543097211612},{"$f":"+INDEX(O129:O130,Sheet1!$J$69)","v":96.712274633605404}]
[null,null,{"$f":"+INDEX(C131:C132,Sheet1!$J$69)  & \" (\" & Sheet1!F69 & \")\"","v":"Superfície cultivada (ha)"},{"$f":"+INDEX(D131:D132,Sheet1!$J$69)","v":100},{"$f":"+INDEX(E131:E132,Sheet1!$J$69)","v":96.273701145976489},{"$f":"+INDEX(F131:F132,Sheet1!$J$69)","v":98.813783348255583},{"$f":"+INDEX(G131:G132,Sheet1!$J$69)","v":91.504779120635888},{"$f":"+INDEX(H131:H132,Sheet1!$J$69)","v":85.029659111442356},{"$f":"+INDEX(I131:I132,Sheet1!$J$69)","v":74.581108699821257},{"$f":"+INDEX(J131:J132,Sheet1!$J$69)","v":71.229239268641379},{"$f":"+INDEX(K131:K132,Sheet1!$J$69)","v":65.254146788306031},{"$f":"+INDEX(L131:L132,Sheet1!$J$69)","v":69.675687879653438},{"$f":"+INDEX(M131:M132,Sheet1!$J$69)","v":70.829276367934838},{"$f":"+INDEX(N131:N132,Sheet1!$J$69)","v":69.472676407325125},{"$f":"+INDEX(O131:O132,Sheet1!$J$69)","v":79.757679535268537}]
[null,null,null,{"$f":"+Sheet1!$M$69&\" \" &C124& \" passou de \" &+TEXT(D124,\"### ### ###\")& \" \" & Sheet1!$E$69& \" em 1989 para \" &+TEXT(O124,\"### ### ###\")& \" \" &Sheet1!$E$69& \" em 2019. \" & Sheet1!$Q$69&\" \" &C125& \" passou de \" &+TEXT(D125,\"### ### ###\")& \" \" & Sheet1!$F$69& \" em 1989 para \" &+TEXT(O125,\"### ### ###\")& \" \" &Sheet1!$F$69& \" em 2019.\"","v":"A área de Superfície Total Das Explorações (ha) passou de 100 ha em 1989 para 97 ha em 2019. A área de Superfície cultivada (ha) passou de 100 ha em 1989 para 80 ha em 2019."}]
[null,null,null,{"$f":"+Sheet1!$M$69&\" \" &C124& \" em 2019 era \" &+TEXT(O124,\"### ### ###\")& \"% do valor de 1989. \" & Sheet1!$Q$69&\" \" &C125& \" em 2019 era \" &+TEXT(O125,\"### ### ###\")& \"% do valor de 1989.\"","v":"A área de Superfície Total Das Explorações (ha) em 2019 era 97% do valor de 1989. A área de Superfície cultivada (ha) em 2019 era 80% do valor de 1989."}]
[null,null,null,1989,1993,1995,1997,1999,2003,2005,2007,2009,2013,2016,2019]
[null,null,{"$f":"+Sheet1!C69","v":"Superfície Total Das Explorações"},{"$f":"+INDEX(Sheet1!D$72:D$135,Sheet1!$D$69)","v":5157213},{"$f":"+INDEX(Sheet1!E$72:E$135,Sheet1!$D$69)","v":4999731},{"$f":"+INDEX(Sheet1!F$72:F$135,Sheet1!$D$69)","v":4929405},{"$f":"+INDEX(Sheet1!G$72:G$135,Sheet1!$D$69)","v":4800054},{"$f":"+INDEX(Sheet1!H$72:H$135,Sheet1!$D$69)","v":5039569},{"$f":"+INDEX(Sheet1!I$72:I$135,Sheet1!$D$69)","v":4719438},{"$f":"+INDEX(Sheet1!J$72:J$135,Sheet1!$D$69)","v":4632024},{"$f":"+INDEX(Sheet1!K$72:K$135,Sheet1!$D$69)","v":4272503},{"$f":"+INDEX(Sheet1!L$72:L$135,Sheet1!$D$69)","v":4571531},{"$f":"+INDEX(Sheet1!M$72:M$135,Sheet1!$D$69)","v":4492242},{"$f":"+INDEX(Sheet1!N$72:N$135,Sheet1!$D$69)","v":4515890},{"$f":"+INDEX(Sheet1!O$72:O$135,Sheet1!$D$69)","v":4987658}]
[null,null,{"$f":"+C129","v":"Superfície Total Das Explorações"},{"$f":"+D129/$D129*100","v":100},{"$f":"+E129/$D129*100","v":96.946373942670192},95.582730439871298,93.074573417851852,97.718845430661872,91.511403542960124,89.816418286388398,82.845191773153445,88.643439780361987,87.106000857439852,{"$f":"+N129/$D129*100","v":87.564543097211612},96.712274633605404]
[null,null,{"$f":"+Sheet1!G69","v":"Superfície cultivada"},{"$f":"+INDEX(Sheet1!D$72:D$135,Sheet1!$H$69)","v":2706251},{"$f":"+INDEX(Sheet1!E$72:E$135,Sheet1!$H$69)","v":2605408},{"$f":"+INDEX(Sheet1!F$72:F$135,Sheet1!$H$69)","v":2674149},{"$f":"+INDEX(Sheet1!G$72:G$135,Sheet1!$H$69)","v":2476349},{"$f":"+INDEX(Sheet1!H$72:H$135,Sheet1!$H$69)","v":2301116},{"$f":"+INDEX(Sheet1!I$72:I$135,Sheet1!$H$69)","v":2018352},{"$f":"+INDEX(Sheet1!J$72:J$135,Sheet1!$H$69)","v":1927642},{"$f":"+INDEX(Sheet1!K$72:K$135,Sheet1!$H$69)","v":1765941},{"$f":"+INDEX(Sheet1!L$72:L$135,Sheet1!$H$69)","v":1885599},{"$f":"+INDEX(Sheet1!M$72:M$135,Sheet1!$H$69)","v":1916818},{"$f":"+INDEX(Sheet1!N$72:N$135,Sheet1!$H$69)","v":1880105},{"$f":"+INDEX(Sheet1!O$72:O$135,Sheet1!$H$69)","v":2158443}]
[null,null,{"$f":"+C131","v":"Superfície cultivada"},{"$f":"+D131/$D131*100","v":100},{"$f":"+E131/$D131*100","v":96.273701145976489},98.813783348255583,91.504779120635888,85.029659111442356,74.581108699821257,71.229239268641379,65.254146788306031,69.675687879653438,70.829276367934838,{"$f":"+N131/$D131*100","v":69.472676407325125},79.757679535268537]
[]
[null,null,null,1989,1993,1995,1997,1999,2003,2005,2007,2009,2013,2016,2019]
[null,null,null,null,{"$f":"+E129/$D129*100","v":96.946373942670192},95.582730439871298,93.074573417851852,97.718845430661872,91.511403542960124,89.816418286388398,82.845191773153445,88.643439780361987,87.106000857439852,{"$f":"+N129/$D129*100","v":87.564543097211612},96.712274633605404]
[null,null,null,null,{"$f":"+E131/$D131*100","v":96.273701145976489},98.813783348255583,91.504779120635888,85.029659111442356,74.581108699821257,71.229239268641379,65.254146788306031,69.675687879653438,70.829276367934838,{"$f":"+N131/$D131*100","v":69.472676407325125},79.757679535268537]

{"sheet":"2016","index":8,"n_rows":84,"n_cols":10,"rows_kept":84,"cut":false,"hidden":true,"merged":[[38,0,38,1],[46,0,46,1],[59,0,59,1],[66,0,66,1],[0,0,0,1],[1,0,1,1],[6,0,6,1],[11,0,11,1],[23,0,23,1],[35,0,35,1]]}
[2016,null,"Continente","EDM","TM","BL","BI","LVT","ALE","ALG"]
["EXPLORAÇÕES (nº)",null,235774,39651,56228,39462,29065,31217,28424,11728]
["Explorações por Classe de SAU (nº)"]
["> 0 a <5 ha",null,165331,33094,34351,34558,20264,22478,12428,8157]
["5 a 50 ha",null,58861,6146,20836,4319,7444,7365,9442,3310]
["> 50 ha",null,10395,197,937,133,1348,1149,6388,243]
["SUPERFÍCIE TOTAL DAS EXPLORAÇÕES (ha)",null,4515890,376225,594141,234215,504569,493467,2142617,170655]
["Superfície agrícola utilizada",null,3513006,198415,454719,122929,356488,378010,1906874,95570]
["Matas e florestas sem culturas sob-coberto",null,822722,162497,119425,105016,110752,96072,180595,48364]
["Superfície agrícola não utilizada",null,96491,6743,11476,2597,30031,5421,15661,24563]
["Outras superfícies",null,83671,8570,8522,3673,7297,13964,39487,2158]
["SAU (ha)",null,3513006,198415,454719,122929,356488,378010,1906874,95570]
["SAU por Classe de SAU"]
["<5 ha",null,318159,59634,79476,59084,35827,42368,25978,15791]
["5 a 50 ha",null,798835,71077,260182,51131,113036,98359,161649,43402]
["> 50 ha",null,2396012,67705,115061,12713,207626,237284,1719247,36377]
["Composição da SAU"]
["Terras aráveis",null,1019186,72909,99396,72728,79580,157295,510930,26349]
["Horta familiar",null,15690,2559,4466,2747,2519,1580,1238,581]
["Culturas permanentes",null,700353,29177,189595,28607,66727,94932,243467,47847]
["Pastagens permanentes",null,1777776,93771,161262,18847,207663,124204,1151238,20792]
["      Das quais Pobres:",null,1381157,77226,116855,8878,166717,71493,921643,18344]
[]
["Cultura temporárias(1) (ha)"]
["Total",null,853885,114173,69794,85038,67826,133793,371845,11416]
["Cereais para grão",null,254957,17187,25639,30616,11297,44934,122365,2918]
["Leguminosas secas para grão",null,18043,878,861,1615,1452,394,12693,150]
["Prados temporários",null,91874,9773,7084,3937,6588,5274,56132,3088]
["Culturas forrageiras",null,406626,82244,32212,43275,47238,42073,155461,4124]
["Batata",null,10953,1097,3191,1771,784,3784,197,129]
["Beterraba sacarina",null,"","","","","","","",""]
["Culturas industriais",null,19837,"",50,176,30,3542,15996,43]
["Culturas hortícolas",null,47268,2610,446,3408,358,32579,7260,609]
["Flores e plantas ornamentais",null,1265,218,30,61,"",443,409,105]
["Outras culturas temporárias",null,3063,166,283,179,80,771,1332,251]
["Pousio (ha)",null,251744,3749,34931,8118,18808,28446,142669,15023]
["Superfície cultivada",null,{"$f":"+C8-C22-C36","v":1880105},{"$f":"+D8-D22-D36","v":117440},302933,105933,170963,278071,842562,62203]
[]
["CULTURAS PERMANENTES (ha)",null,700353,29177,189595,28607,66727,94932,243467,47847]
["Frutos frescos (excepto citrinos)",null,46515,2355,9103,1955,7223,19862,3389,2628]
["Citrinos",null,17709,599,358,234,210,863,1715,13731]
["Frutos sub-tropicais",null,3525,2259,8,755,0,13,57,433]
["Frutos de casca rija",null,142523,1628,48793,1601,4697,16637,46766,22402]
["Olival",null,325755,2128,71761,12142,42366,24631,165237,7489]
["Vinha",null,160674,19757,59390,11242,12118,32009,25035,1123]
["Outras culturas permanentes",null,3650,451,182,679,113,916,1268,42]
["PRADOS E PASTAGENS PERMANENTES (2) (ha)",null,1828714,94334,161531,19955,214579,127180,1189454,21682]
[]
["Efetivos (Cabeças Normais)"]
["Efetivos (Cabeças Normais)",null,2003127,250272,131956,323201,108232,506302,664301,18863]
["Por Espécie"]
["Equideos",null,32460,5813,8339,2088,3970,4202,5534,2513]
["Bovinos",null,917913,196884,69364,53196,51518,104955,436701,5295]
["Ovinos",null,219001,10619,32767,11643,33935,14013,111457,4566]
["Caprinos",null,37850,4958,6668,5678,6718,3877,8472,1479]
["Aves",null,368668,21825,6445,151248,4604,179265,4231,1050]
["Suínos",null,425140,9486,8022,98895,7281,199699,97818,3939]
["Coelhos",null,2095,687,351,453,206,291,88,21]
[]
["VOLUME DE TRABALHO (UTA)",null,295316,58000,71193,46289,26215,38663,41838,13117]
["Tipo de Mão-de-Obra"]
["Mão-de-obra agrícola familiar",null,212771,47147,56690,40691,21992,21053,17556,7643]
["Produtor",null,116335,23512,30358,21096,12345,12786,11715,4523]
["Mão-de-obra agrícola não familiar",null,82545,10853,14504,5598,4223,17610,24283,5474]
["Permanente",null,52488,7263,6819,4093,2305,12335,15901,3773]
["Eventual",null,26093,3277,6477,1368,1751,4809,6810,1601]
["POPULAÇÃO AGRÍCOLA (nº)",null,564670,110068,132411,103862,65889,70309,56795,25336]
[" PRODUTORES AGRÍCOLAS (nº)"]
["Homem",null,147962,21062,34434,24617,18059,23068,18656,8065]
["Mulher",null,75543,16326,19642,13846,10239,5889,6306,3295]
["Nível etário do Produtor"]
["15 a 44 anos",null,14914,3239,4309,1850,1064,1810,2118,523]
["45 a 64 anos",null,83576,15330,21084,14748,9099,11123,8855,3339]
["65 e mais anos",null,125015,18819,28684,21866,18135,16023,13989,7499]
["Nível de escolaridade do produtor"]
["Nenhum",null,36127,7217,8866,5158,5576,3344,3928,2040]
["Básico",null,158991,25708,38047,30152,19693,21788,15912,7691]
["Secundário/Pós-secundário",null,14755,2091,3644,1816,1511,2300,2501,893]
["Superior",null,13633,2373,3520,1337,1519,1525,2622,736]
["Formação agrícola do Produtor"]
["Exclusivamente prática",null,118615,19370,26992,17287,17580,12677,17107,7603]
["Curso F.Prof. relacionados c/ activ. agrícola",null,101819,17576,26597,20989,10453,15761,6837,3606]
["Completa (secundário ou superior agrícola)",null,3073,443,488,187,267,519,1018,151]
["(1) Inclui culturas sucessivas e sob coberto de permanentes"]

{"sheet":"2019","index":9,"n_rows":85,"n_cols":10,"rows_kept":85,"cut":false,"hidden":true,"merged":[[46,0,46,1],[59,0,59,1],[66,0,66,1],[85,0,85,1],[0,0,0,1],[1,0,1,1],[6,0,6,1],[23,0,23,1],[35,0,35,1],[38,0,38,1]]}
[2019,null,"Continente","EDM","TM","BL","BI","LVT","ALE","ALG"]
["EXPLORAÇÕES (nº)",null,266039,44560,65211,44245,33617,34486,31131,12789]
["Explorações por Classe de SAU (nº)"]
["> 0 a <5 ha",null,189254,38052,43260,38919,23484,24606,12215,8718]
["5 a 50 ha",null,60776,5518,20624,4229,8355,7950,10555,3545]
["> 50 ha",null,12084,282,874,187,1455,1340,7672,274]
["SUPERFÍCIE TOTAL DAS EXPLORAÇÕES (ha)",null,4987658,339921,677888,226117,585281,559369,2399558,199523]
["Superfície agrícola utilizada",null,3838708,212639,450701,129848,391754,409095,2144066,100605]
["Matas e florestas sem culturas sob-coberto",null,960040,104118,199031,84483,169451,129508,203428,70022]
["Superfície agrícola não utilizada",null,90171,4410,18093,5136,16372,5531,13912,26716]
["Outras superfícies",null,98739,18754,10063,6651,7704,15235,38151,2180]
["SAU (ha)",null,3838708,212639,450701,129848,391754,409095,2144066,100605]
["SAU por Classe de SAU"]
["<5 ha",null,353291,63010,92818,61592,46208,46683,25768,17213]
["5 a 50 ha",null,823120,62487,253718,49925,120119,106836,183631,46405]
["> 50 ha",null,2662297,87142,104166,18331,225427,255575,1934668,36988]
["Composição da SAU"]
["Terras aráveis",null,1007264,69154,88830,65213,87377,169307,509271,18112]
["Horta familiar",null,15719,2437,4957,3344,2271,1211,1045,455]
["Culturas permanentes",null,855767,33133,222821,36042,83834,99448,323733,56754]
["Pastagens permanentes",null,1959958,107915,134094,25249,218272,139128,1310017,25284]
["     Das quais Pobres:",null,1455897,90707,84367,13731,152929,98242,995047,20871]
[]
["CULTURAS TEMPORÁRIAS(1) (ha)"]
["Total",null,843477,100037,51070,64585,73122,146221,396323,12120]
["Cereais para grão",null,234530,17439,20812,26291,13195,49904,104293,2596]
["Leguminosas secas para grão",null,18666,584,1329,1225,1575,1291,12556,106]
["Prados temporários",null,105802,3941,2900,2803,9191,7331,77978,1659]
["Culturas forrageiras",null,406264,73342,22692,28622,47943,46610,180896,6158]
["Batata",null,12586,1434,2355,1938,745,5228,803,83]
["Beterraba sacarina"]
["Culturas industriais",null,10507,112,52,77,62,1524,8533,148]
["Culturas hortícolas",null,50509,2767,867,3355,308,32534,9763,915]
["Flores e plantas ornamentais",null,1828,345,23,108,10,502,564,276]
["Outras culturas temporárias",null,2786,73,40,166,94,1298,937,178]
["Pousio (ha)",null,224368,5186,38925,9606,18940,28193,117489,6029]
["SUPERFÚICIE CULTIVADA",null,2158443,116746,327409,106511,219885,282660,1031530,73705]
[]
["CULTURAS PERMANENTES (ha)",null,855767,33133,222821,36042,83834,99448,323733,56754]
["Frutos frescos (excepto citrinos)",null,51292,3404,10411,2675,8804,17042,5213,3744]
["Citrinos",null,19146,820,438,371,386,1283,1898,13951]
["Frutos sub-tropicais",null,6145,2564,55,916,23,295,355,1937]
["Frutos de casca rija",null,228487,1941,71907,2949,11033,24680,89797,26179]
["Olival",null,377234,1085,81691,15440,49373,22609,197628,9409]
["Vinha",null,171111,23193,58218,12861,14097,32933,28295,1513]
["Outras culturas permanentes",null,2351,126,100,832,118,606,548,21]
["PRADOS E PASTAGENS PERMANENTES (2) (ha)",null,2003795,108213,134164,25952,223452,143450,1343020,25545]
["SUPERFÍCIE IRRIGÁVEL",null,626820,91281,42658,55615,55897,126084,232627,22658]
[]
["Efetivos (Cabeças Normais)",null,2267450,237876,94804,418735,132886,658868,707171,17112]
["Por Espécie"]
["Equideos",null,30384,5387,6430,2256,3009,6782,5314,1206]
["Bovinos",null,906929,180991,41409,50626,59965,104359,462997,6583]
["Ovinos",null,217175,9007,23638,11831,34634,20082,113957,4027]
["Caprinos",null,35946,4578,4861,5568,5835,5106,8562,1437]
["Aves",null,566045,25867,10049,238399,20376,266078,4494,782]
["Suínos",null,507671,11041,7562,109258,8806,256139,111799,3066]
["Coelhos",null,3300,1005,855,797,261,322,48,11]
[]
["VOLUME DE TRABALHO (UTA)",null,293236,56658,62774,47053,27098,41752,44182,13720]
["Tipo de Mão-de-Obra"]
["Mão-de-obra agrícola familiar",null,196990,45104,48235,38928,21712,20030,15847,7134]
["Produtor",null,109949,23292,26734,20760,12189,12153,10487,4335]
["Mão-de-obra agrícola não familiar",null,96246,11554,14539,8125,5386,21722,28335,6586]
["Permanente",null,57110,6975,5539,5493,3067,14447,17833,3755]
["Eventual",null,28990,3942,7244,2206,1924,5773,6945,958]
["POPULAÇÃO AGRÍCOLA (nº)",null,599497,114401,143317,106829,72361,76016,59051,27522]
[" PRODUTORES AGRÍCOLAS (nº)"]
["Homem",null,168459,24950,40517,29255,21898,24188,19311,8340]
["Mulher",null,82156,17095,22787,13420,10526,7192,7346,3790]
["Nível etário do Produtor"]
["15 a 44 anos",null,24151,4754,5801,3361,2493,3291,3457,994]
["45 a 64 anos",null,90767,16852,23102,15829,10387,11615,9511,3471]
["65 e mais anos",null,135697,20439,34401,23485,19544,16474,13689,7665]
["Nível de escolaridade do produtor"]
["Nenhum",null,26704,5156,7170,3771,4266,2260,2519,1562]
["Básico",null,174793,29872,43356,32744,21771,22806,16159,8085]
["Secundário/Pós-secundário",null,25017,3481,6245,3528,3198,3590,3671,1304]
["Superior",null,24101,3536,6533,2632,3189,2724,4308,1179]
["Formação agrícola do Produtor"]
["Exclusivamente prática",null,131980,19933,34851,18439,20115,13734,16371,8537]
["Curso F.Prof. relacionados c/ activ. agrícola",null,113974,21524,27625,23813,11874,16850,8853,3435]
["Completa (secundário ou superior agrícola)",null,4661,588,828,423,435,796,1433,158]
["(1) Inclui culturas sucessivas e sob coberto de permanentes"]
["(2) inclui pastagens sob coberto de permanentes"]

{"sheet":"Sheet1","index":10,"n_rows":135,"n_cols":24,"rows_kept":135,"cut":false,"hidden":true,"merged":[]}
[null,null,null,2,{"$f":"+F1-1","v":3},4,null,2,{"$f":"+J1-1","v":2},3]
[null,null,null,{"$f":"+INDEX($S$3:$S$8,D1)","v":"Superfície Agrícola Útil (Ha)"},{"$f":"+INDEX($X$3:$X$10,F1)","v":"Beira Litoral"},null,null,{"$f":"+INDEX($S$3:$S$8,H1)","v":"Superfície Agrícola Útil (Ha)"},{"$f":"+INDEX($X$3:$X$10,J1)","v":"Trás-os-Montes"}]
[null,"EXPLORAÇÕES (nº)",null,1989,1993,1995,1997,1999,2003,2005,2007,2009,2013,2016,2019,null,null,null,"Nº de Explorações",null,null,null,0,"Continente"]
[null,1,0,550879,446146,412064,381793,382163,330656,297046,251547,278114,240527,235774,266039,null,{"$f":"+B4&C4","v":"10"},null,"Superfície Agrícola Útil (Ha)",null,null,null,1,"Entre Douro e Minho"]
[null,1,1,111505,86967,79916,73048,67546,58757,52696,45848,49037,41601,39651,44560,null,{"$f":"+B5&C5","v":"11"},null,"Volume de Trabalho (UTA)",null,null,null,2,"Trás-os-Montes"]
[null,1,2,80551,75678,72248,70098,70006,64963,61649,56339,61804,57224,56228,65211,null,{"$f":"+B6&C6","v":"12"},null,"População agrícola (Pessoas)",null,null,null,3,"Beira Litoral"]
[null,1,3,125307,97459,88547,80217,79806,66060,58823,47542,49424,38356,39462,44245,null,{"$f":"+B7&C7","v":"13"},null,"Efetivos (Cabeças Normais)",null,null,null,4,"Beira Interior"]
[null,1,4,60386,49533,45878,42841,48313,40788,35749,30357,33763,30862,29065,33617,null,"14",null,"Superfície Irrigável",null,null,null,5,"Ribatejo e Oeste"]
[null,1,5,99938,78609,71430,64874,61615,52375,43850,33225,39875,31450,31217,34486,null,"15",null,"Pastagens Pobres",null,null,null,6,"Alentejo"]
[null,1,6,47049,37491,36114,34722,35906,31830,29558,26032,31828,29478,28424,31131,null,"16",null,"Superfície cultivada",null,null,null,7,"Algarve"]
[null,1,7,26143,20409,17931,15993,18971,15883,14721,12204,12383,11556,11728,12789,null,"17"]
[null,2,0,3879579,3821319,3800379,3700161,3736140,3578034,3552347,3357019,3542305,3517740,3513006,3838708,null,"20"]
[null,2,1,289624,257684,239465,243450,215675,233702,232260,220371,211154,214554,198415,212639,null,"21"]
[null,2,2,489133,493229,495965,462230,457881,467158,473530,474617,432873,432056,454719,450701,null,"22",null,"Valor Absoluto"]
[null,2,3,231458,220532,205702,179896,169779,154781,151949,135986,125436,117387,122929,129848,null,"23",null,"Índice 100 (IND100=1989)"]
[null,2,4,433947,443745,441138,435052,418977,390252,384005,352257,337031,341976,356488,391754,null,"24",null,"Índice 100 (IND100=1989)"]
[null,2,5,456544,498887,483831,494427,447853,381558,412093,349237,391006,370390,378010,409095,null,"25"]
[null,2,6,1842094,1766678,1800535,1757360,1924043,1836215,1792285,1721795,1956508,1949142,1906874,2144066,null,"26"]
[null,2,7,136779,140565,133743,127745,101932,114368,106225,102756,88297,92234,95570,100605,null,"27"]
[null,3,0,810005,576661,551197,492999,497537,431521,376370,319369,341502,304677,295316,293236,null,"30"]
[null,3,1,218450,153824,150023,127545,122487,103124,88050,74273,78758,68404,58000,56658,null,"31"]
[null,3,2,99162,81023,81412,73226,81566,77400,67260,65072,69330,68998,71193,62774,null,"32"]
[null,3,3,188075,127288,121948,105164,107553,88993,79738,59518,65502,48669,46289,47053,null,"33"]
[null,3,4,85447,52671,47625,46443,49193,44165,42588,33624,33552,30355,26215,27098,null,"34"]
[null,3,5,126898,93835,89504,83768,75630,63629,50047,42447,47269,40832,38663,41752,null,"35"]
[null,3,6,61913,48043,43524,42942,44162,40862,35491,32918,35659,35617,41838,44182,null,"36"]
[null,3,7,30061,19976,17161,13911,16946,13348,13197,11515,11432,11801,13117,13720,null,"37"]
[null,4,0,1799736,1408613,1261088,1133401,1123418,935316,787102,656296,709928,604926,564670,599497,null,"40"]
[null,4,1,466783,345726,306268,274338,248443,203845,175226,145511,150588,124339,110068,114401,null,"41"]
[null,4,2,255688,227653,212261,198007,196960,174969,155729,138630,151529,138731,132411,143317,null,"42"]
[null,4,3,426328,325453,286032,251190,246329,197024,168002,133515,134174,106486,103862,106829,null,"43"]
[null,4,4,163719,129743,118858,109048,121920,101031,83230,68638,78470,73147,65889,72361,null,"44"]
[null,4,5,295495,229219,202173,176355,170116,140110,106022,84673,96111,76290,70309,76016,null,"45"]
[null,4,6,121804,95794,88222,83601,91678,79884,65591,57425,69849,61473,56795,59051,null,"46"]
[null,4,7,69919,55025,47274,40861,47972,38453,33302,27904,29207,24460,25336,27522,null,"47"]
[null,5,0,2244750,2172008,2153381,2137756,2326716,2141186,1870284,1818513,1986998,1821369,2003127,2267450,null,"50"]
[null,5,1,388240,362528,370666,355515,338093,312049,264036,252849,262882,250374,250272,237876,null,"51"]
[null,5,2,171436,149289,155925,156310,146251,128966,113109,111591,105501,100703,131956,94804,null,"52"]
[null,5,3,451737,429439,420307,409316,421915,377544,347084,322546,340199,276747,323201,418735,null,"53"]
[null,5,4,153055,141195,144140,146145,139043,131171,112322,106514,107103,103087,108232,132886,null,"54"]
[null,5,5,578619,613489,566832,557618,660006,585432,441481,437883,510485,456473,506302,658868,null,"55"]
[null,5,6,446631,437198,458583,477532,581052,569037,566410,561773,641608,614835,664301,707171,null,"56"]
[null,5,7,55033,38870,36926,35320,40358,36983,25841,25357,19222,19149,18863,17112,null,"57"]
[null,6,0,871590,826628,789727,791355,787236,"n.d",613209,580164,536127,547119,543745,626820,null,"60"]
[null,6,1,225517,206876,189320,186069,148305,"n.d",118667,115633,94829,106476,90938,91281,null,"61"]
[null,6,2,99854,115563,113943,112582,93101,"n.d",67215,53153,46666,46675,43953,42658,null,"62"]
[null,6,3,143821,137292,121984,108008,104609,"n.d",82996,76595,61116,57133,56385,55615,null,"63"]
[null,6,4,112734,95693,84986,88021,92717,"n.d",69918,61928,49580,38008,45571,55897,null,"64"]
[null,6,5,144692,143313,145815,146604,154509,"n.d",109076,116336,112539,111985,114330,126084,null,"65"]
[null,6,6,110753,93551,99870,115652,163983,"n.d",140376,136856,155123,169573,175410,232627,null,"66"]
[null,6,7,34218,34340,33809,34419,30012,"n.d",24962,19663,16274,17269,17158,22658,null,"67"]
[null,7,0,343025,294075,317110,364843,872378,1041709,1251051,1266034,1315241,1267891,1381157,1455897,null,"70"]
[null,7,1,39897,29386,31401,48310,60529,88819,92071,93390,82563,86289,77226,90707,null,"71"]
[null,7,2,24813,23331,26404,20137,48793,71609,99636,119069,78774,75875,116855,84367,null,"72"]
[null,7,3,5652,5378,3245,3717,8266,7891,8941,8139,6355,7277,8878,13731,null,"73"]
[null,7,4,76852,68511,61689,79083,130180,147971,151786,137056,122438,116156,166717,152929,null,"74"]
[null,7,5,16894,4284,11790,42451,29986,35131,78535,82488,67575,63409,71493,98242,null,"75"]
[null,7,6,172627,158962,180434,166020,585295,671152,803032,807809,939771,901521,921643,995047,null,"76"]
[null,7,7,6288,4223,2147,5123,9328,19137,17050,18081,17766,17364,18344,20871,null,"77"]
[null,8,0,2706251,2605408,2674149,2476349,2301116,2018352,1927642,1765941,1885599,1916818,1880105,2158443,null,"80"]
[null,8,1,249232,225709,207003,194404,154687,144225,139341,126069,124740,125023,117440,116746,null,"81"]
[null,8,2,402574,402131,398475,381224,358926,345617,324562,307987,313514,312790,302933,327409,null,"82"]
[null,8,3,221597,210342,198944,173085,158639,144910,138047,122083,113294,102446,105933,106511,null,"83"]
[null,8,4,298152,291024,310846,285679,258053,220992,214132,192061,195598,204267,170963,219885,null,"84"]
[null,8,5,408521,460522,435214,407201,384047,314721,299917,241068,291251,278527,278071,282660,null,"85"]
[null,8,6,1023623,921206,1033153,951285,909420,777905,745666,715057,791016,832112,842562,1031530,null,"86"]
[null,8,7,102553,94474,90514,83472,77345,69981,65977,61618,56185,61652,62203,73705,null,"87"]
[]
[null,null,{"$f":"+INDEX($C$72:$C$135,D69)","v":"Superfície Total Das Explorações"},5,{"$f":"+INDEX(B72:B135,D69)","v":"ha"},{"$f":"+INDEX(B72:B135,H69)","v":"ha"},{"$f":"+INDEX($C$72:$C$135,H69)","v":"Superfície cultivada"},30,{"$f":"+INDEX(S14:S15,J69)","v":"Índice 100 (IND100=1989)"},2,null,null,{"$f":"+INDEX($Q$72:$Q$135,D69)","v":"A área de"},null,null,null,{"$f":"+INDEX($Q$72:$Q$135,H69)","v":"A área de"}]
[]
[null,null,null,1989,1993,1995,1997,1999,2003,2005,2007,2009,2013,2016,2019]
[null,"","Nº de Explorações",550879,446146,412064,381793,382163,330656,297046,251547,278114,240527,235774,266039,null,"O","Unidade técnico-económica que utiliza fatores de produção comuns, tais como: mão de obra, máquinas, instalações, terrenos, entre outros, e que deve satisfazer obrigatoriamente as quatro condições seguintes: 1. produzir produtos agrícolas ou manter em boas condições agrícolas e ambientais as terras que já não são utilizadas para fins produtivos; 2. atingir ou ultrapassar uma certa dimensão (área, número de animais); 3. estar submetida a uma gestão única; 4. estar localizada num local bem determinado e identificável."]
[null,"","Nº de Explorações > 0 a <5 ha",446184,343780,311525,286550,296010,249826,218948,179656,207062,170929,165331,189254,null,"O","Unidade técnico-económica que utiliza fatores de produção comuns, tais como: mão de obra, máquinas, instalações, terrenos, entre outros, e que deve satisfazer obrigatoriamente as quatro condições seguintes: 1. produzir produtos agrícolas ou manter em boas condições agrícolas e ambientais as terras que já não são utilizadas para fins produtivos; 2. atingir ou ultrapassar uma certa dimensão (área, número de animais); 3. estar submetida a uma gestão única; 4. estar localizada num local bem determinado e identificável."]
[null,"","Nº de Explorações 5 a 50 ha",91424,91810,89783,84931,73258,69253,66865,61534,59667,58536,58861,60776,null,"O","Unidade técnico-económica que utiliza fatores de produção comuns, tais como: mão de obra, máquinas, instalações, terrenos, entre outros, e que deve satisfazer obrigatoriamente as quatro condições seguintes: 1. produzir produtos agrícolas ou manter em boas condições agrícolas e ambientais as terras que já não são utilizadas para fins produtivos; 2. atingir ou ultrapassar uma certa dimensão (área, número de animais); 3. estar submetida a uma gestão única; 4. estar localizada num local bem determinado e identificável."]
[null,"","Nº de Explorações > 50 ha",9050,9287,9601,9340,9612,9393,9971,9485,10047,10249,10395,12084,null,"O","Unidade técnico-económica que utiliza fatores de produção comuns, tais como: mão de obra, máquinas, instalações, terrenos, entre outros, e que deve satisfazer obrigatoriamente as quatro condições seguintes: 1. produzir produtos agrícolas ou manter em boas condições agrícolas e ambientais as terras que já não são utilizadas para fins produtivos; 2. atingir ou ultrapassar uma certa dimensão (área, número de animais); 3. estar submetida a uma gestão única; 4. estar localizada num local bem determinado e identificável."]
[null,"ha","Superfície Total Das Explorações",5157213,4999731,4929405,4800054,5039569,4719438,4632024,4272503,4571531,4492242,4515890,4987658,null,"A área de","Soma da superfície agrícola utilizada, da superfície das matas e florestas sem culturas sob-coberto, da superfície agrícola não utilizada e das outras superfícies da exploração."]
[null,"ha","Superfície agrícola utilizada",3879579,3821319,3800379,3700161,3736140,3578034,3552347,3357019,3542305,3517740,3513006,3838708,null,"A área de","Superfície da exploração que inclui: terras aráveis (limpa e sob-coberto de matas e florestas), horta familiar, culturas permanentes e pastagens permanentes."]
[null,"ha","Superfície de Matas e florestas sem culturas sob-coberto",965676,867336,803967,801053,997497,878078,838801,707750,837431,800482,822722,960040,null,"A área de","Superfícies cobertas com árvores ou arbustos florestais, incluindo choupais, quer se trate de povoamentos puros (com uma só espécie), quer de povoamentos mistos (com espécies diversas) bem como os viveiros florestais localizados no interior das florestas e que se destinam às necessidades da exploração."]
[null,"ha","Superfície agrícola não utilizada",243534,215329,218610,208216,201084,180743,158346,134587,125283,99394,96491,90171,null,"A área de","Superfície da exploração anteriormente utilizada como superfície agrícola, mas que já o não é por razões económicas, sociais ou outras. Não entra em rotações culturais. Pode voltar a ser utilizada com auxílio dos meios geralmente disponíveis na exploração."]
[null,"ha","Outras superfícies",68425,95747,106448,90624,104848,82584,82531,73146,66512,74626,83671,98739,null,"A área de","Áreas ocupadas por edifícios, eiras, pátios, caminhos, barragens, albufeiras e ainda jardins, matas e florestas orientadas exclusivamente para fins de proteção do ambiente ou de recreio."]
[null,"ha","SAU de explorações  <5 ha",731458,625118,574760,527529,513791,463738,401651,335945,382341,325926,318159,353291,null,"A área de","Superfície da exploração que inclui: terras aráveis (limpa e sob-coberto de matas e florestas), horta familiar, culturas permanentes e pastagens permanentes."]
[null,"ha","SAU de explorações 5 a 50 ha",1090803,1133878,1126281,1070249,928258,891107,860460,805855,777505,797420,798835,823120,null,"A área de","Superfície da exploração que inclui: terras aráveis (limpa e sob-coberto de matas e florestas), horta familiar, culturas permanentes e pastagens permanentes."]
[null,"ha","SAU de explorações > 50 ha",2057316,2062323,2099337,2102382,2294091,2223188,2290236,2215219,2382459,2394395,2396012,2662297,null,"A área de","Superfície da exploração que inclui: terras aráveis (limpa e sob-coberto de matas e florestas), horta familiar, culturas permanentes e pastagens permanentes."]
[null,"ha","Terras aráveis",2330327,2258395,2111584,2082578,1725887,1513900,1228939,1066583,1158805,1081311,1019186,1007264,null,"A área de","Terras cultivadas destinadas à produção vegetal, as terras retiradas da produção, ou que sejam mantidas em boas condições agrícolas e ambientais nos termos do artigo 5º do Regulamento (CE) n.º 1782/2003, e as terras ocupadas por estufas ou cobertas por estruturas fixas ou móveis."]
[null,"ha","Horta familiar",31765,29826,27176,25574,20965,19274,20712,17830,18991,14473,15690,15719,null,"A área de","Superfície normalmente inferior a 20 ares, reservada à cultura de produtos tais como hortícolas, frutos e flores destinados fundamentalmente ao autoconsumo e não para venda."]
[null,"ha","Culturas permanentes",780966,748594,739153,700068,705232,676598,643520,592393,686221,704302,700353,855767,null,"A área de","Culturas que ocupam a terra durante um longo período e fornecem repetidas colheitas, não entrando em rotações culturais. Não incluem os prados e pastagens permanentes. No caso das árvores de fruto só são considerados os povoamentos regulares, com densidade mínima de 100 árvores, ou de 45 no caso de oliveiras, figueiras e frutos secos."]
[null,"ha","Pastagens permanentes",736521,784504,922465,891940,1284056,1368262,1659175,1680214,1678288,1717653,1777776,1959958,null,"A área de","Plantas semeadas ou espontâneas, em geral herbáceas, destinadas a serem comidas pelo gado no local em que vegetam, mas que acessoriamente podem ser cortadas em determinados períodos do ano. Não estão incluídas numa rotação e ocupam o solo por um período superior a 5 anos."]
[null,"ha","Pastagens Pobres",350343,300950,323422,373744,879592,1048207,1253239,1274245,1331198,1280628,1391293,1455897,null,"A área de"]
[null,"ha","Cultura temporárias - Total",1869929,1667685,1600085,1483750,1378415,1177310,992324,859525,923537,840993,853885,843477,null,"A área de","Culturas cujo ciclo vegetativo não excede um ano (as anuais) e também as que são ressemeadas com intervalos que não excedem cinco anos (morangos, espargos, prados temporários, etc.)."]
[null,"ha","Cultura temporárias - Cereais para grão",896507,702538,675457,649423,601003,479372,383912,303307,345556,305390,254957,234530,null,"A área de","Cereais semeados com a intenção de obter grão após maturação completa, independentemente do destino da cultura."]
[null,"ha","Cultura temporárias - Leguminosas secas para grão",80711,41902,38484,28508,25246,21684,13858,15467,13152,9257,18043,18666,null,"A área de","Leguminosas cultivadas para colheita do grão após maturação completa, quer se destinem à alimentação humana ou à alimentação animal."]
[null,"ha","Cultura temporárias - Prados temporários",73865,47210,45348,43112,37246,45280,49219,64718,31652,35532,91874,105802,null,"A área de","Plantas herbáceas semeadas, destinadas a serem comidas pelo gado no local onde vegetam, integradas numa rotação, ocupando o solo por um período geralmente não superior a 5 anos. Acessoriamente podem ser cortados em determinados períodos do ano."]
[null,"ha","Cultura temporárias - Culturas forrageiras",565460,641601,623571,589063,528049,487696,466300,389993,442320,414201,406626,406264,null,"A área de","Culturas destinadas ao corte para dar ao gado e que são colhidas antes de completarem o seu ciclo vegetativo (maturação), de modo a serem melhor digeridas pelos animais. Podem ser consumidas pelo gado em verde, depois de conservadas como feno ou silagem ou secas ao Sol ou desidratadas artificialmente."]
[null,"ha","Cultura temporárias - Batata",103652,81496,77462,55454,47313,36561,24356,20685,17331,11879,10953,12586,null,"A área de"]
[null,"ha","Cultura temporárias - Beterraba sacarina",39,0,0,0,7551,5115,7012,2108,0,0,"",null,null,"A área de"]
[null,"ha","Cultura temporárias - Culturas industriais",63960,83433,76965,57082,74400,50964,8880,17473,24764,19007,19837,10507,null,"A área de","Culturas que se destinam a transformação industrial tais como o tabaco, lúpulo, colza, girassol, soja, plantas aromáticas e cana-de-açúcar entre outras. Não inclui o tomate para a indústria."]
[null,"ha","Cultura temporárias - Culturas hortícolas",61709,51305,54492,50161,49708,42286,36000,37519,46367,41205,47268,50509,null,"A área de","Culturas hortícolas"]
[null,"ha","Cultura temporárias - Flores e plantas ornamentais",633,841,813,1077,1004,1195,1375,1614,1525,2588,1265,1828,null,"A área de","Espécies florícolas e outras plantas ornamentais, quer sejam de interior quer de exterior, independentemente de serem ou não utilizadas para a produção de flor ou de folhagem de corte."]
[null,"ha","Cultura temporárias - Outras culturas temporárias",23393,17358,7491,9870,6889,7157,1413,6641,870,1934,3063,2786,null,"A área de"]
[null,"ha","Pousio",830303,921836,809120,858969,562646,517973,373654,325044,341465,333031,251744,224368,null,"A área de","Terras incluídas no afolhamento ou rotação, trabalhadas ou não, não fornecendo colheitas durante toda a campanha, tendo em vista o seu melhoramento. Podem apresentar-se sob as formas de: a) terras sem qualquer cultura; b) terras com uma vegetação espontânea, em certos casos utilizada pelos animais ou enterrada; c) terras semeadas tendo em vista a exclusiva produção de matéria verde para ser enterrada e aumentar a fertilidade do solo."]
[null,"ha","Superfície cultivada",2706251,2605408,2674149,2476349,2301116,2018352,1927642,1765941,1885599,1916818,1880105,2158443,null,"A área de"]
[null,"ha","Culturas Permanentes - Total",780966,748595,739153,700067,705232,676599,643519,592392,686221,704303,700351,855767,null,"A área de","Culturas que ocupam a terra durante um longo período e fornecem repetidas colheitas, não entrando em rotações culturais. Não incluem os prados e pastagens permanentes. No caso das árvores de fruto só são considerados os povoamentos regulares, com densidade mínima de 100 árvores, ou de 45 no caso de oliveiras, figueiras e frutos secos."]
[null,"ha","Culturas Permanentes - Frutos frescos (excepto citrinos)",75715,76218,70493,62439,52342,46465,40230,36800,39746,42667,46515,51292,null,"A área de"]
[null,"ha","Culturas Permanentes - Citrinos",25598,25089,23890,23557,22428,19802,19101,18083,16389,17424,17709,19146,null,"A área de"]
[null,"ha","Culturas Permanentes - Frutos sub-tropicais",1042,1297,1122,1094,1197,1038,1390,1469,1764,2412,3525,6145,null,"A área de"]
[null,"ha","Culturas Permanentes - Frutos de casca rija",73738,69964,71345,74698,80281,72820,70951,68877,114980,139750,142523,228487,null,"A área de"]
[null,"ha","Culturas Permanentes - Olival",340514,321675,330337,308731,335028,324061,317046,292162,335841,340284,325755,377234,null,"A área de"]
[null,"ha","Culturas Permanentes - Vinha",262025,252015,239722,227375,211821,210314,192846,172765,175773,160424,160674,171111,null,"A área de"]
[null,"ha","Culturas Permanentes - Outras culturas permanentes",2334,2337,2244,2173,2135,2099,1955,2236,1728,1342,3650,2351,null,"A área de"]
[null,"ha","Prados E Pastagens Permanentes",754825,808586,950879,919058,1331033,1419417,1706263,1723221,1721587,1773304,1828714,2003795,null,"A área de","Plantas semeadas ou espontâneas, em geral herbáceas, destinadas a serem comidas pelo gado no local em que vegetam, mas que acessoriamente podem ser cortadas em determinados períodos do ano. Não estão incluídas numa rotação e ocupam o solo por um período superior a 5 anos."]
[null,"Nº de Cabeças","Cabeças normais - Total",2244750,2172008,2153381,2137756,2326716,2141186,1870284,1818513,1986998,1821369,2003127,2267450,null,null,"Cabeça normal (CN)», a unidade padrão de equivalência usada para comparar e agregar números de animais de diferentes espécies ou categorias, tendo em consideração a espécie animal, a idade, o peso vivo e a vocação produtiva, relativamente às necessidades alimentares e à produção de efluentes pecuários"]
[null,"Nº de Cabeças","Cabeças normais - bovinos",869750,782593,858047,825150,845530,835827,783377,776740,840627,816716,917913,30384]
[null,"Nº de Cabeças","Cabeças normais - ovinos",291204,276866,276623,272575,291772,267620,252600,233457,221117,205730,219001,906929]
[null,"Nº de Cabeças","Cabeças normais - caprinos",69747,59248,56611,53442,51902,42583,43191,37950,40563,36943,37850,217175]
[null,"Nº de Cabeças","Cabeças normais - aves",326654,332315,310583,323692,478407,423382,301785,311728,392820,301723,368668,35946]
[null,"Nº de Cabeças","Cabeças normais - suínos",565212,624125,562408,581231,579978,504746,437229,414078,444066,420122,425140,566045]
[null,"Nº de Cabeças","Cabeças normais - equidios",112690,88753,81551,75016,72435,60874,46866,39804,42594,36843,32460,507671]
[null,"Nº de Cabeças","Cabeças normais - coelhos",9493,8108,7558,6650,6692,6154,5236,4756,5211,3292,2095,3300]
[null,"ha","Superfície Irrigável",871590,826628,789727,791355,787236,"n.d",613209,580164,536127,547119,543745,626820,null,null,"Superfície máxima da exploração que no decurso do ano agrícola, poderia, se necessário, ser irrigada por meio de instalações técnicas próprias da exploração e por uma quantidade de água normalmente disponível."]
[null,"UTA","Volume De Trabalho",810005,576661,551197,492999,497537,431521,376370,319369,341502,304677,295316,293236,null,"O","Corresponde ao trabalho efetivamente aplicado na produção de produtos agrícolas e das atividades não agrícolas não separáveis das unidades agrícolas que compõem o Ramo. Por definição, pode ser dividido em Assalariado e Não - assalariado, e é expresso em unidades de trabalho ano (UTA), correspondendo estas à prestação, medida em tempo de trabalho, de uma pessoa que efetua, a tempo inteiro e durante todo o ano, atividades agrícolas numa unidade agrícola."]
[null,"UTA","Tipo de Mão-de-Obra - Agrícola familiar",687485,484712,460220,406351,408224,352376,309759,260110,272783,230012,212771,196990,null,"O Volume de trabalho de","Pessoas pertencentes ao agregado doméstico do produtor que trabalham na exploração, bem como os membros da família do produtor que não pertencendo ao seu agregado doméstico trabalham regularmente na exploração."]
[null,"UTA","Tipo de Mão-de-Obra - Produtor",311206,231524,221960,200648,206241,180870,163899,138618,147342,123072,116335,109949,null,"O Volume de trabalho de","Responsável jurídico e económico da exploração, isto é, a pessoa física ou moral por conta e em nome da qual a exploração produz, retira os benefícios e suporta as perdas eventuais, tomando as decisões de fundo relativas ao sistema de produção, investimentos, empréstimos, etc."]
[null,"UTA","Tipo de Mão-de-Obra - Agrícola não familiar - Total",122520,91948,90977,86647,89313,79145,66611,59258,68718,74664,82545,96246,null,"O Volume de trabalho de","Pessoas remuneradas pela exploração e ocupadas nos trabalhos agrícolas da exploração que não sejam nem o produtor nem membros da sua família."]
[null,"UTA","Tipo de Mão-de-Obra - Agrícola não familiar - Permanente",58932,46524,44232,41976,43962,40758,38402,35820,38960,46010,52488,57110,null,"O Volume de trabalho de","Pessoas remuneradas pela exploração e ocupadas nos trabalhos agrícolas da exploração que não sejam nem o produtor nem membros da sua família."]
[null,"UTA","Tipo de Mão-de-Obra - Agrícola não familiar - Eventual",60565,43112,44590,42655,42525,35967,26351,21677,26000,23795,26093,28990,null,"O Volume de trabalho de","Pessoas remuneradas pela exploração e ocupadas nos trabalhos agrícolas da exploração que não sejam nem o produtor nem membros da sua família."]
[null,"Nº de Pessoas","População Agrícola (Nº)",1799736,1408613,1261088,1133401,1123418,935316,787102,656296,709928,604926,564670,599497,null,"A","Conjunto de pessoas que fazem parte do agregado doméstico do produtor (singular) quer trabalhem ou não na exploração, bem como de outros membros da família que não pertencendo ao agregado doméstico, participam regularmente nos trabalhos agrícolas da exploração."]
[null,"Nº de Pessoas"," Produtores Agrícolas (Nº) - Homem",462535,368061,335627,306245,289291,248858,216600,180885,186194,156995,147962,168459,null,"OS","Conjunto de pessoas que fazem parte do agregado doméstico do produtor (singular) quer trabalhem ou não na exploração, bem como de outros membros da família que não pertencendo ao agregado doméstico, participam regularmente nos trabalhos agrícolas da exploração."]
[null,"Nº de Pessoas"," Produtores Agrícolas (Nº) - Mulher",83534,73350,71413,70052,86647,75665,73896,64395,84313,72973,75543,82156,null,"OS","Conjunto de pessoas que fazem parte do agregado doméstico do produtor (singular) quer trabalhem ou não na exploração, bem como de outros membros da família que não pertencendo ao agregado doméstico, participam regularmente nos trabalhos agrícolas da exploração."]
[null,"Nº de Pessoas"," Produtores Agrícolas (Nº) - 15 a 44 anos",107122,72074,62146,51852,55538,35871,29417,21858,24403,17842,14914,24151,null,"OS","Conjunto de pessoas que fazem parte do agregado doméstico do produtor (singular) quer trabalhem ou não na exploração, bem como de outros membros da família que não pertencendo ao agregado doméstico, participam regularmente nos trabalhos agrícolas da exploração."]
[null,"Nº de Pessoas"," Produtores Agrícolas (Nº) - 45 a 64 anos",282161,222105,201020,181582,176575,134653,120906,102461,112932,88447,83576,90767,null,"OS","Conjunto de pessoas que fazem parte do agregado doméstico do produtor (singular) quer trabalhem ou não na exploração, bem como de outros membros da família que não pertencendo ao agregado doméstico, participam regularmente nos trabalhos agrícolas da exploração."]
[null,"Nº de Pessoas"," Produtores Agrícolas (Nº) - 65 e mais anos",156786,147232,143874,142863,143825,154000,140172,120960,133172,123680,125015,135697,null,"OS","Conjunto de pessoas que fazem parte do agregado doméstico do produtor (singular) quer trabalhem ou não na exploração, bem como de outros membros da família que não pertencendo ao agregado doméstico, participam regularmente nos trabalhos agrícolas da exploração."]
[null,"Nº de Pessoas"," Produtores Agrícolas - Escolaridade - Nenhum",255187,190085,165348,146863,129360,105666,84731,61900,60040,43102,36127,26704,null,"OS"]
[null,"Nº de Pessoas"," Produtores Agrícolas - Escolaridade - Básico",268772,231253,228016,215583,228474,201224,188739,168350,186768,159711,158991,174793,null,"OS"]
[null,"Nº de Pessoas"," Produtores Agrícolas - Escolaridade - Secundário/Pós-secundário",16041,13567,6143,6635,8230,7980,7338,6476,11361,13784,14755,25017,null,"OS"]
[null,"Nº de Pessoas"," Produtores Agrícolas - Escolaridade - Superior",6069,6507,7533,7216,9874,9653,9687,8554,12338,13372,13633,24101,null,"OS"]

{"sheet":"Evolução regional","index":11,"n_rows":106,"n_cols":20,"rows_kept":106,"cut":false,"hidden":true,"merged":[[0,1,0,17],[6,1,6,16],[29,1,29,16]]}
[null,"Evolução Estrutural Regional das Explorações Agrícolas"]
[]
[null,"Escolha variável e região 1",null,null,null,null,null,null,"Escolha variável e região 2"]
[]
[]
[]
[null,{"$f":"+\"Evolução comparativa em valor absoluto\"","v":"Evolução comparativa em valor absoluto"}]
[]
[]
[]
[]
[]
[]
[]
[]
[]
[]
[]
[]
[]
[]
[]
[]
[]
[]
[]
[]
[]
[]
[null,{"$f":"+\"Evolução comparativa em Índice (IND100=1989)\"","v":"Evolução comparativa em Índice (IND100=1989)"}]
[]
[]
[]
[]
[]
[]
[]
[]
[]
[]
[]
[]
[]
[]
[]
[]
[null,null,null,null,null,null,null,null,null,null,null,null,null,null,null,null,null,null,"Fonte"]
[]
[null,null,null,null,null,null,null,null,null,null,null,null,null,null,null,null,null,null,null,"Recenseamento Agrícola 1989, 1999, 2009"]
[null,null,null,null,null,null,null,null,null,null,null,null,null,null,null,null,null,null,null,"Inquérito à Estrutura das Explorações Agrícolas 1993, 1995, 1997, 2003, 2005, 2007, 2013, 2016"]
[]
[]
[]
[]
[]
[]
[]
[]
[]
[]
[]
[]
[]
[]
[]
[]
[]
[]
[]
[]
[]
[]
[]
[]
[]
[]
[]
[]
[]
[]
[]
[]
[]
[]
[]
[]
[]
[]
[]
[]
[]
[]
[]
[]
[]
[]
[]
[null,null,null,1989,1993,1995,1997,1999,2003,2005,2007,2009,2013,2016,2019]
[null,null,{"$f":"+Sheet1!D2& \" - \" &Sheet1!E2","v":"Superfície Agrícola Útil (Ha) - Beira Litoral"},{"$f":"+SUMIF(Sheet1!$Q$4:$Q$51,Sheet1!$D$1&Sheet1!$E$1,Sheet1!D4:D51)","v":231458},{"$f":"+SUMIF(Sheet1!$Q$4:$Q$51,Sheet1!$D$1&Sheet1!$E$1,Sheet1!E4:E51)","v":220532},{"$f":"+SUMIF(Sheet1!$Q$4:$Q$51,Sheet1!$D$1&Sheet1!$E$1,Sheet1!F4:F51)","v":205702},{"$f":"+SUMIF(Sheet1!$Q$4:$Q$51,Sheet1!$D$1&Sheet1!$E$1,Sheet1!G4:G51)","v":179896},{"$f":"+SUMIF(Sheet1!$Q$4:$Q$51,Sheet1!$D$1&Sheet1!$E$1,Sheet1!H4:H51)","v":169779},{"$f":"+SUMIF(Sheet1!$Q$4:$Q$51,Sheet1!$D$1&Sheet1!$E$1,Sheet1!I4:I51)","v":154781},{"$f":"+SUMIF(Sheet1!$Q$4:$Q$51,Sheet1!$D$1&Sheet1!$E$1,Sheet1!J4:J51)","v":151949},{"$f":"+SUMIF(Sheet1!$Q$4:$Q$51,Sheet1!$D$1&Sheet1!$E$1,Sheet1!K4:K51)","v":135986},{"$f":"+SUMIF(Sheet1!$Q$4:$Q$51,Sheet1!$D$1&Sheet1!$E$1,Sheet1!L4:L51)","v":125436},{"$f":"+SUMIF(Sheet1!$Q$4:$Q$51,Sheet1!$D$1&Sheet1!$E$1,Sheet1!M4:M51)","v":117387},{"$f":"+SUMIF(Sheet1!$Q$4:$Q$51,Sheet1!$D$1&Sheet1!$E$1,Sheet1!N4:N51)","v":122929},{"$f":"+SUMIF(Sheet1!$Q$4:$Q$51,Sheet1!$D$1&Sheet1!$E$1,Sheet1!O4:O51)","v":129848}]
[null,null,{"$f":"+Sheet1!H2& \" - \" &Sheet1!I2","v":"Superfície Agrícola Útil (Ha) - Trás-os-Montes"},{"$f":"+SUMIF(Sheet1!$Q$4:$Q$51,Sheet1!$H$1&Sheet1!$I$1,Sheet1!D4:D51)","v":489133},{"$f":"+SUMIF(Sheet1!$Q$4:$Q$51,Sheet1!$H$1&Sheet1!$I$1,Sheet1!E4:E51)","v":493229},{"$f":"+SUMIF(Sheet1!$Q$4:$Q$51,Sheet1!$H$1&Sheet1!$I$1,Sheet1!F4:F51)","v":495965},{"$f":"+SUMIF(Sheet1!$Q$4:$Q$51,Sheet1!$H$1&Sheet1!$I$1,Sheet1!G4:G51)","v":462230},{"$f":"+SUMIF(Sheet1!$Q$4:$Q$51,Sheet1!$H$1&Sheet1!$I$1,Sheet1!H4:H51)","v":457881},{"$f":"+SUMIF(Sheet1!$Q$4:$Q$51,Sheet1!$H$1&Sheet1!$I$1,Sheet1!I4:I51)","v":467158},{"$f":"+SUMIF(Sheet1!$Q$4:$Q$51,Sheet1!$H$1&Sheet1!$I$1,Sheet1!J4:J51)","v":473530},{"$f":"+SUMIF(Sheet1!$Q$4:$Q$51,Sheet1!$H$1&Sheet1!$I$1,Sheet1!K4:K51)","v":474617},{"$f":"+SUMIF(Sheet1!$Q$4:$Q$51,Sheet1!$H$1&Sheet1!$I$1,Sheet1!L4:L51)","v":432873},{"$f":"+SUMIF(Sheet1!$Q$4:$Q$51,Sheet1!$H$1&Sheet1!$I$1,Sheet1!M4:M51)","v":432056},{"$f":"+SUMIF(Sheet1!$Q$4:$Q$51,Sheet1!$H$1&Sheet1!$I$1,Sheet1!N4:N51)","v":454719},{"$f":"+SUMIF(Sheet1!$Q$4:$Q$51,Sheet1!$H$1&Sheet1!$I$1,Sheet1!O4:O51)","v":450701}]
[]
[]
[]
[null,null,null,1989,1993,1995,1997,1999,2003,2005,2007,2009,2013,2016,2019]
[null,null,{"$f":"+C99 & \" (IND100 = 1989)\"","v":"Superfície Agrícola Útil (Ha) - Beira Litoral (IND100 = 1989)"},{"$f":"+D99/$D99*100","v":100},95.279489151379522,88.872279204002453,77.722956216678625,73.351968823717471,66.872175513484095,65.648627396763132,58.751911793932379,54.193849424085585,50.716328664379716,53.110715550985489,{"$f":"+O99/$D99*100","v":56.100026786717251}]
[null,null,{"$f":"+C100 & \" (IND100 = 1989)\"","v":"Superfície Agrícola Útil (Ha) - Trás-os-Montes (IND100 = 1989)"},{"$f":"+D100/$D100*100","v":100},100.83740005274639,101.39675711922933,94.49985995629001,93.610735730363729,95.507356894750501,96.810070062743677,97.03230000838218,88.498015877072291,88.330985641941965,92.964285787301208,{"$f":"+O100/$D100*100","v":92.142832317590518}]