{"text_format":"1","workbook":"xlsx","n_sheets":12,"sheets":["Portugal","Indice","Continente","1989","1999","2009","2013","Evolução Estrutura","2016","2019","Sheet1","Evolução regional"],"not_rendered":{"charts":3,"images":4,"macros":1,"external_links":0,"defined_names":2,"comments":1,"pivot_tables":0},"unopened":[],"bounds":{"document_bytes":16777216,"sheet_cells":100000,"rows_first":2000,"rows_last":500,"rows_between":2000,"halvings":0,"cell_chars":16384,"cell_head_chars":4096},"cells_cut":0,"cells_raw":0,"read":"whole","date_system":"1900"}

{"sheet":"Portugal","index":0,"n_rows":173,"n_cols":16,"rows_kept":173,"cut":false,"hidden":true,"merged":[[0,0,0,3],[1,0,1,3]]}
["Portugal",null,null,null,1989,1993,1995,1997,1999,2003,2005,2007,2009,2013,2016,2019]
["EXPLORAÇÕES (nº)"]
["Portugal",null,null,null,598742,489011,450635,416689,415969,359248,323920,275085,305266,264419,258983,290229]
["    Continente",null,null,null,550879,446145,412065,381794,382163,330619,297046,251548,278114,240527,235774,266039]
["      Entre Douro e Minho",null,null,null,111505,86967,79916,73048,67546,58757,52696,45848,49037,41601,39651,44560]
["  Trás-os-Montes",null,null,null,80551,75678,72248,70098,70006,64963,61649,56339,61804,57224,56228,65211]
["      Beira Litoral",null,null,null,125307,97459,88547,80217,79806,66060,58823,47542,49424,38356,39462,44245]
["  Beira Interior",null,null,null,60386,49533,45878,42841,48313,40788,35749,30357,33763,30862,29065,33617]
["      Ribatejo e Oeste",null,null,null,99938,78609,71430,64874,61615,52339,43850,33225,39875,31450,31217,34486]
["  Alentejo",null,null,null,47049,37491,36114,34722,35906,31830,29558,26032,31828,29478,28424,31131]
["      Algarve",null,null,null,26143,20409,17931,15993,18971,15883,14721,12204,12383,11556,11728,12789]
["Açores",null,null,null,24706,21998,20141,18056,19280,16191,15285,13155,13541,11825,11580,10656]
["    Madeira",null,null,null,23157,20868,18430,16839,14526,12437,11589,10382,13611,12068,11628,13534]
[]
["Explorações por Classe de SAU (nº)"]
["> 0 a <5 ha",null,null,null,488075,380765,344412,316069,324432,273172,241019,198688,229526,190305,183881,208961]
["5 a 50 ha",null,null,null,97107,97441,95228,90037,78275,74166,71280,65678,63881,62568,62941,64614]
["> 50 ha",null,null,null,9236,9470,9799,9592,9905,9729,10318,9828,10460,10702,10915,12616]
[]
["SUPERFÍCIE TOTAL DAS EXPLORAÇÕES (ha)"]
{"$rows_left_out":154}
{"sheet":"Indice","index":1,"n_rows":33,"n_cols":13,"rows_kept":33,"cut":false,"hidden":false,"merged":[]}
[]
[]
[]
[]
[]
[]
[]
[]
[]
[null,"Evolução Estrutural das Explorações Agrícolas do Continente 1989 - 2019"]
[]
[]
[null,null,null,null,null,null,null,null,null,null,null,null,"Acesso aos dados:"]
[]
[]
[]
[]
[]
[]
[]
{"$rows_left_out":14}
{"sheet":"Continente","index":2,"n_rows":157,"n_cols":16,"rows_kept":157,"cut":false,"hidden":true,"merged":[[58,0,58,3],[0,0,0,3],[1,0,1,3],[16,0,16,3],[23,0,23,3],[45,0,45,3],[61,0,61,3],[69,0,69,3],[70,0,70,3],[107,0,107,3],[124,0,124,3],[74,0,74,3]]}
["Continente",null,null,null,1989,1993,1995,1997,1999,2003,2005,2007,2009,2013,2016,2019]
["EXPLORAÇÕES (nº)"]
["Continente",null,null,null,550879,446146,412064,381793,382163,330656,297046,251547,278114,240527,235774,266039]
["Entre Douro e Minho",null,null,null,111505,86967,79916,73048,67546,58757,52696,45848,49037,41601,39651,44560]
["Trás-os-Montes",null,null,null,80551,75678,72248,70098,70006,64963,61649,56339,61804,57224,56228,65211]
["Beira Litoral",null,null,null,125307,97459,88547,80217,79806,66060,58823,47542,49424,38356,39462,44245]
["Beira Interior",null,null,null,60386,49533,45878,42841,48313,40788,35749,30357,33763,30862,29065,33617]
["Ribatejo e Oeste",null,null,null,99938,78609,71430,64874,61615,52375,43850,33225,39875,31450,31217,34486]
["Alentejo",null,null,null,47049,37491,36114,34722,35906,31830,29558,26032,31828,29478,28424,31131]
["Algarve",null,null,null,26143,20409,17931,15993,18971,15883,14721,12204,12383,11556,11728,12789]
[]
["Explorações por Classe de SAU (nº)"]
["> 0 a <5 ha",null,null,null,446184,343780,311525,286550,296010,249826,218948,179656,207062,170929,165331,189254]
["5 a 50 ha",null,null,null,91424,91810,89783,84931,73258,69253,66865,61534,59667,58536,58861,60776]
["> 50 ha",null,null,null,9050,9287,9601,9340,9612,9393,9971,9485,10047,10249,10395,12084]
[]
["SUPERFÍCIE TOTAL DAS EXPLORAÇÕES (ha)"]
["Continente",null,null,null,5157213,4999731,4929405,4800054,5039569,4719438,4632024,4272503,4571531,4492242,4515890,4987658]
["Superfície agrícola utilizada",null,null,null,3879579,3821319,3800379,3700161,3736140,3578034,3552347,3357019,3542305,3517740,3513006,3838708]
["Matas e florestas sem culturas sob-coberto",null,null,null,965676,867336,803967,801053,997497,878078,838801,707750,837431,800482,822722,960040]
{"$rows_left_out":138}
{"sheet":"1989","index":3,"n_rows":85,"n_cols":10,"rows_kept":85,"cut":false,"hidden":true,"merged":[[35,0,35,1],[0,0,0,1],[1,0,1,1],[6,0,6,1],[23,0,23,1],[38,0,38,1],[46,0,46,1],[59,0,59,1],[66,0,66,1],[85,0,85,1]]}
[1989,null,"Continente","EDM","TM","BL","BI","LVT","ALE","ALG"]
["EXPLORAÇÕES (nº)",null,550879,111505,80551,125307,60386,99938,47049,26143]
["Explorações por Classe de SAU (nº)"]
["> 0 a <5 ha",null,446184,101131,52952,118763,45225,83508,24909,19696]
["5 a 50 ha",null,91424,9925,26845,6156,14065,14154,14286,5993]
["> 50 ha",null,9050,128,660,62,1030,912,6039,219]
["SUPERFÍCIE TOTAL DAS EXPLORAÇÕES (ha)",null,5157213,464133,646279,425922,654570,684184,2007281,274845]
["Superfície agrícola utilizada",null,3879579,289624,489133,231458,433947,456544,1842094,136779]
["Matas e florestas sem culturas sob-coberto",null,965676,160966,73494,180590,168428,200065,124548,57585]
["Superfície agrícola não utilizada",null,243534,6418,70570,7357,47225,16262,17216,78486]
["Outras superfícies",null,68425,7126,13082,6517,4970,11313,23423,1995]
["SAU (ha)",null,3879579,289624,489133,231458,433947,456544,1842094,136779]
["SAU por Classe de SAU"]
["<5 ha",null,731458,161763,106275,167716,85372,128885,47458,33989]
["5 a 50 ha",null,1090803,81260,322576,55156,173795,160121,226550,71347]
["> 50 ha",null,2057316,46600,60282,8587,174780,167538,1568086,31444]
["Composição da SAU"]
["Terras aráveis",null,2330327,176575,222025,153148,215620,221287,1278436,63237]
["Horta familiar",null,31765,3816,8003,6505,5938,3593,2562,1348]
["Culturas permanentes",null,780966,45160,178449,56460,100177,171795,169037,59888]
{"$rows_left_out":66}
{"sheet":"1999","index":4,"n_rows":85,"n_cols":10,"rows_kept":85,"cut":false,"hidden":true,"merged":[[38,0,38,1],[46,0,46,1],[59,0,59,1],[66,0,66,1],[0,0,0,1],[1,0,1,1],[6,0,6,1],[23,0,23,1],[35,0,35,1]]}
[1999,null,"Continente","EDM","TM","BL","BI","LVT","ALE","ALG"]
["EXPLORAÇÕES (nº)",null,382163,67546,70006,79806,48313,61615,35906,18971]
["Explorações por Classe de SAU (nº)"]
["> 0 a <5 ha",null,296010,60380,46124,74145,36091,48148,17140,13982]
["5 a 50 ha",null,73258,6830,22984,5061,10857,11370,11529,4627]
["> 50 ha",null,9612,152,722,88,1231,1027,6205,187]
["SUPERFÍCIE TOTAL DAS EXPLORAÇÕES (ha)",null,5039569,374832,637104,316646,618526,706000,2158882,227578]
["Superfície agrícola utilizada",null,3736140,215675,457881,169779,418977,447853,1924043,101932]
["Matas e florestas sem culturas sob-coberto",null,997497,133236,101797,131795,160471,220126,189789,60284]
["Superfície agrícola não utilizada",null,201084,7745,61925,8142,31543,15374,14158,62196]
["Outras superfícies",null,104848,18176,15501,6930,7535,22647,30892,3166]
["SAU (ha)",null,3736140,215675,457881,169779,418977,447853,1924043,101932]
["SAU por Classe de SAU"]
["<5 ha",null,513791,97140,96078,111917,65446,84106,33707,25397]
["5 a 50 ha",null,928258,64978,287293,50293,144511,136405,190137,54642]
["> 50 ha",null,2294091,53557,74510,7569,209020,227342,1700200,21893]
["Composição da SAU"]
["Terras aráveis",null,1725887,106780,152660,99158,152390,204970,975840,34090]
["Horta familiar",null,20965,2627,5473,4479,3585,2750,1265,788]
["Culturas permanentes",null,705232,35529,192795,48292,93058,117592,161657,56309]
{"$rows_left_out":66}
{"sheet":"2009","index":5,"n_rows":85,"n_cols":10,"rows_kept":85,"cut":false,"hidden":true,"merged":[[38,0,38,1],[46,0,46,1],[59,0,59,1],[66,0,66,1],[0,0,0,1],[1,0,1,1],[6,0,6,1],[23,0,23,1],[35,0,35,1]]}
[2009,null,"Continente","EDM","TM","BL","BI","LVT","ALE","ALG"]
["EXPLORAÇÕES (nº)",null,278114,49037,61804,49424,33763,39875,31828,12383]
["Explorações por Classe de SAU (nº)"]
["> 0 a <5 ha",null,207062,42732,41227,44966,24855,29979,14706,8597]
["5 a 50 ha",null,59667,5943,19750,4094,7693,8464,10184,3539]
["> 50 ha",null,10047,191,735,101,1179,1095,6535,211]
["SUPERFÍCIE TOTAL DAS EXPLORAÇÕES (ha)",null,4571531,312756,619172,222136,503126,543222,2205930,165189]
["Superfície agrícola utilizada",null,3542305,211154,432873,125436,337031,391006,1956508,88297]
["Matas e florestas sem culturas sob-coberto",null,837431,91139,141138,87108,133621,133716,204104,46605]
["Superfície agrícola não utilizada",null,125283,3543,40223,5822,24674,8331,14593,28096]
["Outras superfícies",null,66512,6920,4937,3770,7800,10169,30724,2191]
["SAU (ha)",null,3542305,211154,432873,125436,337031,391006,1956508,88297]
["SAU por Classe de SAU"]
["<5 ha",null,382341,73356,88640,71587,46245,56041,29656,16815]
["5 a 50 ha",null,777505,62390,239503,44853,105715,109168,170840,45036]
["> 50 ha",null,2382459,75409,104729,8995,185071,225797,1756013,26446]
["Composição da SAU"]
["Terras aráveis",null,1158805,85759,101615,70547,100001,166379,612176,22327]
["Horta familiar",null,18991,3181,5030,4557,2476,1944,1176,628]
["Culturas permanentes",null,686221,26932,191614,33979,74049,93628,221013,45007]
{"$rows_left_out":66}
{"sheet":"2013","index":6,"n_rows":86,"n_cols":10,"rows_kept":86,"cut":false,"hidden":true,"merged":[[38,0,38,1],[46,0,46,1],[60,0,60,1],[67,0,67,1],[0,0,0,1],[1,0,1,1],[6,0,6,1],[11,0,11,1],[23,0,23,1],[35,0,35,1]]}
[2013,null,"Continente","EDM","TM","BL","BI","LVT","ALE","ALG"]
["EXPLORAÇÕES (nº)",null,240527,41601,57224,38356,30862,31450,29478,11556]
["Explorações por Classe de SAU (nº)"]
["> 0 a <5 ha",null,170929,34958,36763,33787,22572,22192,13094,7563]
["5 a 50 ha",null,58536,6311,19446,4255,6991,7880,9880,3774]
["> 50 ha",null,10249,160,947,127,1290,1133,6386,206]
["SUPERFÍCIE TOTAL DAS EXPLORAÇÕES (ha)",null,4492242,305920,629636,201908,481700,500542,2210340,162196]
["Superfície agrícola utilizada",null,3517740,214554,432056,117387,341976,370390,1949142,92234]
["Matas e florestas sem culturas sob-coberto",null,800482,78380,161286,77716,112576,110706,215120,44698]
["Superfície agrícola não utilizada",null,99394,5144,29164,3215,19009,6334,13407,23122]
["Outras superfícies",null,74626,7842,7130,3591,8139,13113,32670,2141]
["SAU (ha)",null,3517740,214554,432056,117387,341976,370390,1949142,92234]
["SAU por Classe de SAU"]
["<5 ha",null,325926,61143,80763,58033,41743,42278,26893,15073]
["5 a 50 ha",null,797420,69368,258028,49189,98498,105269,167569,49499]
["> 50 ha",null,2394395,84042,93265,10165,201736,222843,1754681,27663]
["Composição da SAU"]
["Terras aráveis",null,1081311,82587,104999,68662,85449,153181,561425,25007]
["Horta familiar",null,14473,2125,4492,2442,1974,1684,1297,460]
["Culturas permanentes",null,704302,26924,196735,28914,75155,94697,235239,46638]
{"$rows_left_out":67}
{"sheet":"Evolução Estrutura","index":7,"n_rows":136,"n_cols":21,"rows_kept":136,"cut":false,"hidden":true,"merged":[[0,1,0,17],[6,1,6,17],[38,1,39,18],[24,20,31,26],[15,20,22,26]]}
[null,"Evolução Estrutural das Explorações Agrícolas do Continente"]
[]
[null,"Escolha variável 1",null,null,null,null,"Escolha variável 2",null,null,null,null,null,"Escolha tipo de evolução"]
[]
[]
[]
[null,{"$f":"+\"Evolução comparativa em \" & Sheet1!I69","v":"Evolução comparativa em Índice 100 (IND100=1989)"}]
[]
[]
[]
[]
[]
[]
[]
[null,null,null,null,null,null,null,null,null,null,null,null,null,null,null,null,null,null,null,null,"Conceito Variável 1"]
[null,null,null,null,null,null,null,null,null,null,null,null,null,null,null,null,null,null,null,null,{"$f":"+Sheet1!C69& \"- \" &INDEX(Sheet1!$R$72:$R$135,Sheet1!$D$69)","v":"Superfície Total Das Explorações- Soma da superfície agrícola utilizada, da superfície das matas e florestas sem culturas sob-coberto, da superfície agrícola não utilizada e das outras superfícies da exploração."}]
[]
[]
[]
[]
{"$rows_left_out":117}
{"sheet":"2016","index":8,"n_rows":84,"n_cols":10,"rows_kept":84,"cut":false,"hidden":true,"merged":[[38,0,38,1],[46,0,46,1],[59,0,59,1],[66,0,66,1],[0,0,0,1],[1,0,1,1],[6,0,6,1],[11,0,11,1],[23,0,23,1],[35,0,35,1]]}
[2016,null,"Continente","EDM","TM","BL","BI","LVT","ALE","ALG"]
["EXPLORAÇÕES (nº)",null,235774,39651,56228,39462,29065,31217,28424,11728]
["Explorações por Classe de SAU (nº)"]
["> 0 a <5 ha",null,165331,33094,34351,34558,20264,22478,12428,8157]
["5 a 50 ha",null,58861,6146,20836,4319,7444,7365,9442,3310]
["> 50 ha",null,10395,197,937,133,1348,1149,6388,243]
["SUPERFÍCIE TOTAL DAS EXPLORAÇÕES (ha)",null,4515890,376225,594141,234215,504569,493467,2142617,170655]
["Superfície agrícola utilizada",null,3513006,198415,454719,122929,356488,378010,1906874,95570]
["Matas e florestas sem culturas sob-coberto",null,822722,162497,119425,105016,110752,96072,180595,48364]
["Superfície agrícola não utilizada",null,96491,6743,11476,2597,30031,5421,15661,24563]
["Outras superfícies",null,83671,8570,8522,3673,7297,13964,39487,2158]
["SAU (ha)",null,3513006,198415,454719,122929,356488,378010,1906874,95570]
["SAU por Classe de SAU"]
["<5 ha",null,318159,59634,79476,59084,35827,42368,25978,15791]
["5 a 50 ha",null,798835,71077,260182,51131,113036,98359,161649,43402]
["> 50 ha",null,2396012,67705,115061,12713,207626,237284,1719247,36377]
["Composição da SAU"]
["Terras aráveis",null,1019186,72909,99396,72728,79580,157295,510930,26349]
["Horta familiar",null,15690,2559,4466,2747,2519,1580,1238,581]
["Culturas permanentes",null,700353,29177,189595,28607,66727,94932,243467,47847]
{"$rows_left_out":65}
{"sheet":"2019","index":9,"n_rows":85,"n_cols":10,"rows_kept":85,"cut":false,"hidden":true,"merged":[[46,0,46,1],[59,0,59,1],[66,0,66,1],[85,0,85,1],[0,0,0,1],[1,0,1,1],[6,0,6,1],[23,0,23,1],[35,0,35,1],[38,0,38,1]]}
[2019,null,"Continente","EDM","TM","BL","BI","LVT","ALE","ALG"]
["EXPLORAÇÕES (nº)",null,266039,44560,65211,44245,33617,34486,31131,12789]
["Explorações por Classe de SAU (nº)"]
["> 0 a <5 ha",null,189254,38052,43260,38919,23484,24606,12215,8718]
["5 a 50 ha",null,60776,5518,20624,4229,8355,7950,10555,3545]
["> 50 ha",null,12084,282,874,187,1455,1340,7672,274]
["SUPERFÍCIE TOTAL DAS EXPLORAÇÕES (ha)",null,4987658,339921,677888,226117,585281,559369,2399558,199523]
["Superfície agrícola utilizada",null,3838708,212639,450701,129848,391754,409095,2144066,100605]
["Matas e florestas sem culturas sob-coberto",null,960040,104118,199031,84483,169451,129508,203428,70022]
["Superfície agrícola não utilizada",null,90171,4410,18093,5136,16372,5531,13912,26716]
["Outras superfícies",null,98739,18754,10063,6651,7704,15235,38151,2180]
["SAU (ha)",null,3838708,212639,450701,129848,391754,409095,2144066,100605]
["SAU por Classe de SAU"]
["<5 ha",null,353291,63010,92818,61592,46208,46683,25768,17213]
["5 a 50 ha",null,823120,62487,253718,49925,120119,106836,183631,46405]
["> 50 ha",null,2662297,87142,104166,18331,225427,255575,1934668,36988]
["Composição da SAU"]
["Terras aráveis",null,1007264,69154,88830,65213,87377,169307,509271,18112]
["Horta familiar",null,15719,2437,4957,3344,2271,1211,1045,455]
["Culturas permanentes",null,855767,33133,222821,36042,83834,99448,323733,56754]
{"$rows_left_out":66}
{"sheet":"Sheet1","index":10,"n_rows":135,"n_cols":24,"rows_kept":135,"cut":false,"hidden":true,"merged":[]}
[null,null,null,2,{"$f":"+F1-1","v":3},4,null,2,{"$f":"+J1-1","v":2},3]
[null,null,null,{"$f":"+INDEX($S$3:$S$8,D1)","v":"Superfície Agrícola Útil (Ha)"},{"$f":"+INDEX($X$3:$X$10,F1)","v":"Beira Litoral"},null,null,{"$f":"+INDEX($S$3:$S$8,H1)","v":"Superfície Agrícola Útil (Ha)"},{"$f":"+INDEX($X$3:$X$10,J1)","v":"Trás-os-Montes"}]
[null,"EXPLORAÇÕES (nº)",null,1989,1993,1995,1997,1999,2003,2005,2007,2009,2013,2016,2019,null,null,null,"Nº de Explorações",null,null,null,0,"Continente"]
[null,1,0,550879,446146,412064,381793,382163,330656,297046,251547,278114,240527,235774,266039,null,{"$f":"+B4&C4","v":"10"},null,"Superfície Agrícola Útil (Ha)",null,null,null,1,"Entre Douro e Minho"]
[null,1,1,111505,86967,79916,73048,67546,58757,52696,45848,49037,41601,39651,44560,null,{"$f":"+B5&C5","v":"11"},null,"Volume de Trabalho (UTA)",null,null,null,2,"Trás-os-Montes"]
[null,1,2,80551,75678,72248,70098,70006,64963,61649,56339,61804,57224,56228,65211,null,{"$f":"+B6&C6","v":"12"},null,"População agrícola (Pessoas)",null,null,null,3,"Beira Litoral"]
[null,1,3,125307,97459,88547,80217,79806,66060,58823,47542,49424,38356,39462,44245,null,{"$f":"+B7&C7","v":"13"},null,"Efetivos (Cabeças Normais)",null,null,null,4,"Beira Interior"]
[null,1,4,60386,49533,45878,42841,48313,40788,35749,30357,33763,30862,29065,33617,null,"14",null,"Superfície Irrigável",null,null,null,5,"Ribatejo e Oeste"]
[null,1,5,99938,78609,71430,64874,61615,52375,43850,33225,39875,31450,31217,34486,null,"15",null,"Pastagens Pobres",null,null,null,6,"Alentejo"]
[null,1,6,47049,37491,36114,34722,35906,31830,29558,26032,31828,29478,28424,31131,null,"16",null,"Superfície cultivada",null,null,null,7,"Algarve"]
[null,1,7,26143,20409,17931,15993,18971,15883,14721,12204,12383,11556,11728,12789,null,"17"]
[null,2,0,3879579,3821319,3800379,3700161,3736140,3578034,3552347,3357019,3542305,3517740,3513006,3838708,null,"20"]
[null,2,1,289624,257684,239465,243450,215675,233702,232260,220371,211154,214554,198415,212639,null,"21"]
[null,2,2,489133,493229,495965,462230,457881,467158,473530,474617,432873,432056,454719,450701,null,"22",null,"Valor Absoluto"]
[null,2,3,231458,220532,205702,179896,169779,154781,151949,135986,125436,117387,122929,129848,null,"23",null,"Índice 100 (IND100=1989)"]
[null,2,4,433947,443745,441138,435052,418977,390252,384005,352257,337031,341976,356488,391754,null,"24",null,"Índice 100 (IND100=1989)"]
[null,2,5,456544,498887,483831,494427,447853,381558,412093,349237,391006,370390,378010,409095,null,"25"]
[null,2,6,1842094,1766678,1800535,1757360,1924043,1836215,1792285,1721795,1956508,1949142,1906874,2144066,null,"26"]
[null,2,7,136779,140565,133743,127745,101932,114368,106225,102756,88297,92234,95570,100605,null,"27"]
[null,3,0,810005,576661,551197,492999,497537,431521,376370,319369,341502,304677,295316,293236,null,"30"]
{"$rows_left_out":116}
{"sheet":"Evolução regional","index":11,"n_rows":106,"n_cols":20,"rows_kept":106,"cut":false,"hidden":true,"merged":[[0,1,0,17],[6,1,6,16],[29,1,29,16]]}
[null,"Evolução Estrutural Regional das Explorações Agrícolas"]
[]
[null,"Escolha variável e região 1",null,null,null,null,null,null,"Escolha variável e região 2"]
[]
[]
[]
[null,{"$f":"+\"Evolução comparativa em valor absoluto\"","v":"Evolução comparativa em valor absoluto"}]
[]
[]
[]
[]
[]
[]
[]
[]
[]
[]
[]
[]
[]
{"$rows_left_out":86}